program: Orca
programVersion: 5.0.2
elementType: Cl Cl O O O N C C C C C C C C C C C C C C C C C C C C C C H H H H H H H H H H H H H H H H H H H
charge: 0
multiplicity: 1
keywords: wb97x-d3
keywords: def2-TZVPP
keywords: def2/J RIJCOSX
keywords: DEFGRID2
keywords: scfconv7
keywords: smallprint printgap noloewdin
keywords: NOSOSCF
formula: C22H19Cl2NO3
InChI: InChI=1/C22H19Cl2NO3/c1-22(2)17(12-19(23)24)20(22)21(26)28-18(13-25)14-7-6-10-16(11-14)27-15-8-4-3-5-9-15/h3-12,17-18,20H,1-2H3
47 atoms
Cl -1.949657 -0.939491 -2.233401
Cl -3.712826 -2.673023 -3.731951
O  1.19882 -1.771096 0.233084
O  -0.4454 -1.135442 1.610892
O  0.772746 4.127458 0.636878
N  4.440264 -1.131982 0.02233
C  -1.629743 -3.974518 0.885829
C  -2.278653 -2.90907 0.071152
C  -0.768182 -2.985188 0.120278
C  -1.735533 -3.902338 2.389159
C  -1.604326 -5.387039 0.3518
C  -2.971548 -3.18406 -1.206845
C  -0.038003 -1.875264 0.759552
C  -2.889708 -2.375157 -2.255547
C  1.946744 -0.632114 0.622509
C  1.479501 0.617354 -0.088687
C  3.338571 -0.930332 0.276426
C  1.347649 1.794793 0.626196
C  1.193541 0.580712 -1.448475
C  0.943436 2.953205 -0.027394
C  0.763993 1.734724 -2.081453
C  0.643702 2.925237 -1.380436
C  1.70471 4.521553 1.555913
C  1.241487 5.135965 2.709555
C  3.068007 4.366865 1.336022
C  2.151208 5.601096 3.646816
C  3.965137 4.827034 2.28707
C  3.514137 5.444419 3.444516
H  -2.691457 -2.080457 0.641685
H  -0.280076 -3.390035 -0.758527
H  -2.627984 -4.436779 2.718841
H  -1.802297 -2.882923 2.760375
H  -0.874386 -4.377703 2.861421
H  -2.523499 -5.91403 0.614882
H  -0.771478 -5.942666 0.783972
H  -1.497378 -5.425803 -0.732453
H  -3.59552 -4.065786 -1.293997
H  1.89374 -0.481435 1.705989
H  1.549981 1.813658 1.690313
H  1.300054 -0.337962 -2.009794
H  0.533746 1.713594 -3.138222
H  0.317489 3.831012 -1.874011
H  0.176517 5.250054 2.863097
H  3.430099 3.896788 0.430642
H  1.78818 6.082586 4.545118
H  5.026319 4.70532 2.114851
H  4.220045 5.803239 4.180949
totalener: -2050.65898713 hartree
nucrepener: 2787.61429419 hartree
electener: -4838.27328132 hartree
oneelecener: -8350.68750863 hartree
twoeener: 3512.41422731 hartree
kineticenergy: 2044.54812674 hartree
xcener: -151.873176303831 hartree
chargesum: 0.0000000
charge: -0.034295 -0.039236 -0.262732 -0.364874 -0.298631 -0.001139 0.115934 -0.027497 -0.128001 -0.249666 -0.269780 -0.250190 0.330254 0.101751 0.308484 0.094103 -0.251032 -0.128834 -0.261275 0.185920 -0.089971 -0.174717 0.224009 -0.205671 -0.148877 -0.091751 -0.119449 -0.143073 0.115672 0.102234 0.086592 0.102417 0.089737 0.095664 0.097635 0.086292 0.119694 0.119589 0.114814 0.138475 0.135776 0.131197 0.127088 0.134856 0.125981 0.130030 0.126495
qa: -0.0343 -0.0392 -0.2627 -0.3649 -0.2986 -0.0011 0.1159 -0.0275 -0.1280 -0.2497 -0.2698 -0.2502 0.3303 0.1018 0.3085 0.0941 -0.2510 -0.1288 -0.2613 0.1859 -0.0900 -0.1747 0.2240 -0.2057 -0.1489 -0.0918 -0.1194 -0.1431 0.1157 0.1022 0.0866 0.1024 0.0897 0.0957 0.0976 0.0863 0.1197 0.1196 0.1148 0.1385 0.1358 0.1312 0.1271 0.1349 0.1260 0.1300 0.1265
va: 1.3140 1.2673 2.1144 2.1385 2.1070 3.1218 3.7427 3.8456 3.8556 3.8999 3.9128 3.9263 4.2152 4.2008 3.8429 3.5851 4.0154 3.9842 3.9936 3.8920 3.9047 4.0371 3.8177 4.0325 3.9287 3.9354 3.9550 3.9592 1.0241 1.0258 1.0027 1.0199 1.0020 1.0005 1.0065 1.0012 1.0158 1.0231 1.0144 1.0200 0.9982 1.0094 1.0132 1.0038 0.9987 0.9995 1.0002
dispcorr: -0.025436377 hartree
energy: -2050.684423509420
dipole: 9.16521 -10.23700 -1.07179 -1.63614 1.19551 -0.44063 25.10123 -24.67167 0.42956
magnitude: 1.23589 au
magnitude: 3.14137 debye
