program: Orca
programVersion: 5.0.2
elementType: Cl Cl O O O N C C C C C C C C C C C C C C C C C C C C C C H H H H H H H H H H H H H H H H H H H
charge: 0
multiplicity: 1
keywords: wb97x-d3
keywords: def2-TZVPP
keywords: def2/J RIJCOSX
keywords: DEFGRID2
keywords: scfconv7
keywords: smallprint printgap noloewdin
keywords: NOSOSCF
formula: C22H19Cl2NO3
InChI: InChI=1/C22H19Cl2NO3/c1-22(2)17(12-19(23)24)20(22)21(26)28-18(13-25)14-7-6-10-16(11-14)27-15-8-4-3-5-9-15/h3-12,17-18,20H,1-2H3
47 atoms
Cl -4.684669 -1.644032 -1.478162
Cl -4.098561 -2.957296 -3.980763
O  1.705915 -1.692139 0.070421
O  -0.096164 -0.823871 1.073851
O  1.266928 4.039355 0.184549
N  4.935806 -1.658553 0.762916
C  -1.306174 -3.63301 0.301833
C  -1.812895 -2.570822 -0.629754
C  -0.325213 -2.706659 -0.391552
C  -1.603478 -3.48298 1.773435
C  -1.289779 -5.072023 -0.155618
C  -2.353244 -2.894268 -1.959091
C  0.387922 -1.636481 0.335718
C  -3.552166 -2.541028 -2.40568
C  2.514269 -0.68203 0.66474
C  2.47274 0.601111 -0.128559
C  3.867105 -1.241216 0.711469
C  1.902569 1.730605 0.43581
C  2.966078 0.632765 -1.428014
C  1.846323 2.909244 -0.299824
C  2.884414 1.806241 -2.157106
C  2.333408 2.948574 -1.597156
C  1.457576 4.406365 1.486741
C  2.690017 4.289785 2.117646
C  0.375504 4.96536 2.150392
C  2.826778 4.733332 3.424075
C  0.530627 5.415175 3.452294
C  1.752774 5.296886 4.097114
H  -2.270983 -1.720761 -0.136158
H  0.256117 -3.167236 -1.182705
H  -0.835949 -3.972601 2.375606
H  -2.556552 -3.962673 2.000882
H  -1.671093 -2.445701 2.090986
H  -2.276015 -5.522082 -0.032263
H  -0.581962 -5.650435 0.439512
H  -1.005491 -5.186836 -1.200928
H  -1.734659 -3.46532 -2.64051
H  2.19663 -0.49166 1.694742
H  1.490026 1.690543 1.436166
H  3.416499 -0.248842 -1.866209
H  3.266116 1.840116 -3.168495
H  2.275927 3.871165 -2.1594
H  3.538995 3.865947 1.596554
H  -0.576009 5.049346 1.642192
H  3.787316 4.64446 3.914187
H  -0.313957 5.854959 3.966055
H  1.86935 5.644869 5.114367
totalener: -2050.66136258 hartree
nucrepener: 2697.02026351 hartree
electener: -4747.68162609 hartree
oneelecener: -8169.34513070 hartree
twoeener: 3421.66350461 hartree
kineticenergy: 2044.53326281 hartree
xcener: -151.870002160558 hartree
chargesum: 0.0000000
charge: -0.038358 -0.042908 -0.259691 -0.379600 -0.297828 -0.001783 0.072748 0.037602 -0.111334 -0.252011 -0.231651 -0.194348 0.363043 0.042424 0.314027 0.004953 -0.255824 -0.109876 -0.182420 0.203208 -0.094782 -0.189349 0.241646 -0.162443 -0.209981 -0.115595 -0.087590 -0.146443 0.091477 0.079674 0.089211 0.091147 0.102188 0.099062 0.095938 0.071691 0.100663 0.117507 0.123569 0.121541 0.129942 0.129857 0.133469 0.126176 0.128595 0.125855 0.126606
qa: -0.0384 -0.0429 -0.2597 -0.3796 -0.2978 -0.0018 0.0727 0.0376 -0.1113 -0.2520 -0.2317 -0.1943 0.3630 0.0424 0.3140 0.0050 -0.2558 -0.1099 -0.1824 0.2032 -0.0948 -0.1893 0.2416 -0.1624 -0.2100 -0.1156 -0.0876 -0.1464 0.0915 0.0797 0.0892 0.0911 0.1022 0.0991 0.0959 0.0717 0.1007 0.1175 0.1236 0.1215 0.1299 0.1299 0.1335 0.1262 0.1286 0.1259 0.1266
va: 1.2892 1.2631 2.1394 2.1244 2.1126 3.1187 3.7600 3.8135 3.8977 3.9157 3.9064 3.8984 4.2289 4.2452 3.8440 3.6364 4.0172 3.9136 4.0396 3.8840 3.9443 4.0438 3.8084 3.9366 4.0410 3.9503 3.9345 3.9642 1.0453 1.0378 1.0018 1.0021 1.0202 1.0036 1.0046 1.0094 1.0262 1.0203 1.0218 1.0160 0.9995 1.0109 1.0040 1.0140 0.9997 0.9987 1.0002
dispcorr: -0.022938921 hartree
energy: -2050.684301499738
dipole: 18.34081 -18.85696 -0.51615 3.24203 -3.27842 -0.03639 21.46805 -21.34122 0.12683
magnitude: 0.53275 au
magnitude: 1.35414 debye
