program: Orca
programVersion: 5.0.2
elementType: Cl Cl O O O N C C C C C C C C C C C C C C C C C C C C C C H H H H H H H H H H H H H H H H H H H
charge: 0
multiplicity: 1
keywords: wb97x-d3
keywords: def2-TZVPP
keywords: def2/J RIJCOSX
keywords: DEFGRID2
keywords: scfconv7
keywords: smallprint printgap noloewdin
keywords: NOSOSCF
formula: C22H19Cl2NO3
InChI: InChI=1/C22H19Cl2NO3/c1-22(2)17(12-19(23)24)20(22)21(26)28-18(13-25)14-7-6-10-16(11-14)27-15-8-4-3-5-9-15/h3-12,17-18,20H,1-2H3
47 atoms
Cl -1.617506 -0.9325 -2.400994
Cl -3.446785 -2.548647 -3.951044
O  1.269308 -1.854893 0.257689
O  -0.405879 -1.130725 1.550642
O  0.551891 3.955839 0.381358
N  4.539335 -1.331968 0.205444
C  -1.706068 -3.903066 0.78666
C  -2.244655 -2.80841 -0.069219
C  -0.746522 -2.976381 0.061271
C  -1.883326 -3.811114 2.282186
C  -1.741302 -5.319457 0.263293
C  -2.887159 -3.052559 -1.379115
C  0.007233 -1.897459 0.725244
C  -2.6796 -2.280334 -2.438525
C  2.03641 -0.724911 0.645181
C  1.64023 0.500183 -0.145238
C  3.433532 -1.083165 0.390282
C  1.293649 1.661929 0.524834
C  1.604821 0.443193 -1.532743
C  0.930362 2.789737 -0.203294
C  1.218744 1.566308 -2.245159
C  0.888216 2.741288 -1.589775
C  1.031619 4.287003 1.619039
C  2.394529 4.301293 1.887631
C  0.115801 4.663943 2.587989
C  2.834012 4.692706 3.141914
C  0.569988 5.065568 3.835541
C  1.926769 5.076419 4.119419
H  -2.634268 -1.950116 0.472991
H  -0.236839 -3.417938 -0.786891
H  -1.903139 -2.786073 2.644181
H  -1.078423 -4.336191 2.799397
H  -2.823425 -4.285685 2.569139
H  -1.5890 -5.374052 -0.815066
H  -2.701575 -5.787967 0.488206
H  -0.963442 -5.920257 0.736016
H  -3.580778 -3.878983 -1.482013
H  1.929852 -0.528416 1.717036
H  1.292262 1.681805 1.607331
H  1.877026 -0.464926 -2.054299
H  1.186448 1.533355 -3.325724
H  0.593572 3.622481 -2.144017
H  3.105914 4.014907 1.123543
H  -0.941485 4.646675 2.359553
H  3.895227 4.704722 3.351803
H  -0.144597 5.363981 4.5908
H  2.276878 5.385533 5.094786
totalener: -2050.65940731 hartree
nucrepener: 2809.42488375 hartree
electener: -4860.08429107 hartree
oneelecener: -8394.40659853 hartree
twoeener: 3534.32230746 hartree
kineticenergy: 2044.54620549 hartree
xcener: -151.872997275808 hartree
chargesum: 0.0000000
charge: -0.032173 -0.040439 -0.259281 -0.372498 -0.295923 -0.001556 0.117116 -0.026796 -0.128484 -0.249383 -0.269668 -0.253073 0.337605 0.103028 0.317796 0.072243 -0.254343 -0.123581 -0.279988 0.219765 -0.084103 -0.186348 0.230414 -0.166799 -0.194185 -0.114254 -0.095746 -0.137601 0.114270 0.102725 0.102167 0.089491 0.086035 0.086538 0.095165 0.097766 0.119715 0.116618 0.115728 0.130388 0.134543 0.130022 0.136473 0.126779 0.130360 0.126663 0.126809
qa: -0.0322 -0.0404 -0.2593 -0.3725 -0.2959 -0.0016 0.1171 -0.0268 -0.1285 -0.2494 -0.2697 -0.2531 0.3376 0.1030 0.3178 0.0722 -0.2543 -0.1236 -0.2800 0.2198 -0.0841 -0.1863 0.2304 -0.1668 -0.1942 -0.1143 -0.0957 -0.1376 0.1143 0.1027 0.1022 0.0895 0.0860 0.0865 0.0952 0.0978 0.1197 0.1166 0.1157 0.1304 0.1345 0.1300 0.1365 0.1268 0.1304 0.1267 0.1268
va: 1.3155 1.2659 2.1241 2.1301 2.1155 3.1213 3.7354 3.8441 3.8617 3.8999 3.9133 3.9261 4.2149 4.2009 3.8414 3.5809 4.0187 3.9441 4.0048 3.8717 3.8896 4.0305 3.8175 3.9633 4.0422 3.9428 3.9325 3.9574 1.0249 1.0257 1.0201 1.0020 1.0026 1.0011 1.0007 1.0063 1.0160 1.0228 1.0191 1.0205 0.9971 1.0106 1.0024 1.0130 0.9993 0.9991 1.0002
dispcorr: -0.025596509 hartree
energy: -2050.685003822991
dipole: 4.52663 -5.75633 -1.22970 -2.06631 1.78508 -0.28122 26.65707 -26.14059 0.51647
magnitude: 1.36309 au
magnitude: 3.46469 debye
