program: Orca
programVersion: 5.0.2
elementType: Cl Cl O O O N C C C C C C C C C C C C C C C C C C C C C C H H H H H H H H H H H H H H H H H H H
charge: 0
multiplicity: 1
keywords: wb97x-d3
keywords: def2-TZVPP
keywords: def2/J RIJCOSX
keywords: DEFGRID2
keywords: scfconv7
keywords: smallprint printgap noloewdin
keywords: NOSOSCF
formula: C22H19Cl2NO3
InChI: InChI=1/C22H19Cl2NO3/c1-22(2)17(12-19(23)24)20(22)21(26)28-18(13-25)14-7-6-10-16(11-14)27-15-8-4-3-5-9-15/h3-12,17-18,20H,1-2H3
47 atoms
Cl -4.278881 -1.181838 -1.976931
Cl -3.7095 -2.88976 -4.230175
O  1.694529 -1.776885 0.193871
O  -0.116508 -0.849192 1.1243
O  1.174346 3.954209 0.19184
N  4.933651 -1.685042 0.810445
C  -1.429292 -3.602146 0.385327
C  -1.796217 -2.577004 -0.646324
C  -0.339646 -2.781713 -0.275317
C  -1.836467 -3.340763 1.81506
C  -1.456927 -5.068721 0.024732
C  -2.242879 -2.942621 -1.997103
C  0.37248 -1.69626 0.429267
C  -3.272661 -2.404958 -2.639948
C  2.498622 -0.740057 0.74724
C  2.419119 0.5237 -0.07462
C  3.859997 -1.279008 0.775393
C  1.855954 1.660462 0.48315
C  2.86335 0.526919 -1.391136
C  1.748895 2.817024 -0.280582
C  2.734919 1.680234 -2.146477
C  2.184651 2.827367 -1.597696
C  1.293943 4.270039 1.51774
C  2.536083 4.320968 2.13775
C  0.140731 4.591107 2.215844
C  2.613676 4.694618 3.469759
C  0.233512 4.972419 3.546368
C  1.466102 5.020327 4.179277
H  -2.234063 -1.671173 -0.242372
H  0.27159 -3.320868 -0.990358
H  -2.817667 -3.781418 1.997893
H  -1.897469 -2.28279 2.055633
H  -1.13264 -3.804605 2.50857
H  -0.838284 -5.639201 0.718857
H  -1.086575 -5.272084 -0.979333
H  -2.474337 -5.457709 0.08688
H  -1.691659 -3.707847 -2.529534
H  2.200595 -0.530757 1.77959
H  1.484035 1.638518 1.499644
H  3.309664 -0.359543 -1.823628
H  3.077428 1.693196 -3.17232
H  2.088295 3.732157 -2.183057
H  3.434203 4.077843 1.584125
H  -0.817301 4.545581 1.715095
H  3.580534 4.737552 3.953425
H  -0.666484 5.225988 4.090667
H  1.534035 5.31339 5.218007
totalener: -2050.66126990 hartree
nucrepener: 2716.02126120 hartree
electener: -4766.68253109 hartree
oneelecener: -8207.42812772 hartree
twoeener: 3440.74559663 hartree
kineticenergy: 2044.53350859 hartree
xcener: -151.870032304957 hartree
chargesum: -0.0000000
charge: -0.038651 -0.043911 -0.259657 -0.380485 -0.297464 -0.002144 0.066734 0.043090 -0.094322 -0.248889 -0.239872 -0.201931 0.361270 0.049665 0.313492 -0.007114 -0.255940 -0.081292 -0.186436 0.190240 -0.092472 -0.189311 0.215044 -0.151051 -0.190224 -0.117967 -0.098193 -0.136453 0.088243 0.078895 0.089828 0.102847 0.088474 0.095483 0.072692 0.099449 0.097557 0.116714 0.118513 0.121082 0.129172 0.129400 0.134687 0.127466 0.129247 0.127126 0.127374
qa: -0.0387 -0.0439 -0.2597 -0.3805 -0.2975 -0.0021 0.0667 0.0431 -0.0943 -0.2489 -0.2399 -0.2019 0.3613 0.0497 0.3135 -0.0071 -0.2559 -0.0813 -0.1864 0.1902 -0.0925 -0.1893 0.2150 -0.1511 -0.1902 -0.1180 -0.0982 -0.1365 0.0882 0.0789 0.0898 0.1028 0.0885 0.0955 0.0727 0.0994 0.0976 0.1167 0.1185 0.1211 0.1292 0.1294 0.1347 0.1275 0.1292 0.1271 0.1274
va: 1.2888 1.2615 2.1400 2.1240 2.1100 3.1192 3.7551 3.8194 3.8804 3.9155 3.9109 3.9191 4.2250 4.2492 3.8490 3.6552 4.0151 3.8845 4.0382 3.8914 3.9485 4.0365 3.8332 3.9544 4.0363 3.9481 3.9357 3.9551 1.0486 1.0372 1.0016 1.0211 1.0019 1.0041 1.0098 1.0028 1.0298 1.0193 1.0241 1.0163 0.9993 1.0113 1.0032 1.0127 0.9996 0.9989 0.9999
dispcorr: -0.023017282 hartree
energy: -2050.684287181558
dipole: 14.58596 -15.25071 -0.66476 1.41641 -1.50268 -0.08627 24.19272 -23.88413 0.30859
magnitude: 0.73795 au
magnitude: 1.87572 debye
