program: Orca
programVersion: 5.0.2
elementType: Cl Cl O O O N C C C C C C C C C C C C C C C C C C C C C C H H H H H H H H H H H H H H H H H H H
charge: 0
multiplicity: 1
keywords: wb97x-d3
keywords: def2-TZVPP
keywords: def2/J RIJCOSX
keywords: DEFGRID2
keywords: scfconv7
keywords: smallprint printgap noloewdin
keywords: NOSOSCF
formula: C22H19Cl2NO3
InChI: InChI=1/C22H19Cl2NO3/c1-22(2)17(12-19(23)24)20(22)21(26)28-18(13-25)14-7-6-10-16(11-14)27-15-8-4-3-5-9-15/h3-12,17-18,20H,1-2H3
47 atoms
Cl -2.137675 0.090124 2.730615
Cl -4.577358 0.38907 1.216486
O  1.50995 -1.722645 -1.18467
O  1.435481 -2.461821 0.924241
O  1.621291 3.294448 -0.060728
N  3.91133 -1.08483 -3.372244
C  -1.355152 -3.593591 0.067927
C  -1.538632 -2.286764 0.77311
C  -0.56506 -2.386636 -0.393572
C  -0.69011 -4.718124 0.823797
C  -2.411735 -4.081977 -0.895159
C  -2.758294 -1.480552 0.635056
C  0.873834 -2.216789 -0.106806
C  -3.103858 -0.47391 1.428008
C  2.871581 -1.365464 -0.991876
C  3.011666 -0.088609 -0.197205
C  3.434497 -1.210171 -2.335181
C  2.223689 1.006454 -0.529929
C  3.918036 -0.018847 0.846199
C  2.343509 2.177136 0.204458
C  4.046612 1.166533 1.556258
C  3.262323 2.261426 1.246223
C  0.425033 3.189285 -0.720283
C  0.277422 3.864769 -1.920517
C  -0.629998 2.471051 -0.172448
C  -0.944842 3.827713 -2.576291
C  -1.84403 2.437692 -0.839862
C  -2.006218 3.114819 -2.040841
H  -1.047579 -2.219784 1.737627
H  -0.888634 -1.950858 -1.331595
H  0.027346 -4.370743 1.562128
H  -0.170355 -5.390256 0.13898
H  -1.449951 -5.302136 1.345333
H  -3.241591 -4.542285 -0.356328
H  -1.990328 -4.835134 -1.56179
H  -2.817518 -3.291757 -1.526257
H  -3.448247 -1.719772 -0.164242
H  3.417205 -2.171266 -0.489715
H  1.524453 0.946636 -1.354864
H  4.512786 -0.882462 1.113077
H  4.752355 1.231357 2.373291
H  3.348958 3.183874 1.804924
H  1.112124 4.418725 -2.329394
H  -0.510173 1.952274 0.770559
H  -1.063146 4.357911 -3.511916
H  -2.672776 1.891876 -0.409397
H  -2.958109 3.090033 -2.553803
totalener: -2050.66108342 hartree
nucrepener: 2890.84642216 hartree
electener: -4941.50750558 hartree
oneelecener: -8556.87216093 hartree
twoeener: 3615.36465535 hartree
kineticenergy: 2044.53780488 hartree
xcener: -151.872658458841 hartree
chargesum: 0.0000000
charge: -0.041394 -0.050387 -0.270710 -0.365536 -0.296261 0.000345 0.077354 0.018963 -0.069259 -0.245847 -0.268735 -0.167073 0.324971 0.028768 0.314934 0.046936 -0.254388 -0.181858 -0.150940 0.213496 -0.084475 -0.202134 0.219171 -0.189305 -0.171567 -0.090331 -0.089762 -0.157711 0.095322 0.088552 0.102969 0.088622 0.089362 0.104953 0.096962 0.076226 0.103209 0.122139 0.131536 0.105236 0.126366 0.128770 0.127223 0.129038 0.127031 0.133607 0.125610
qa: -0.0414 -0.0504 -0.2707 -0.3655 -0.2963 0.0003 0.0774 0.0190 -0.0693 -0.2458 -0.2687 -0.1671 0.3250 0.0288 0.3149 0.0469 -0.2544 -0.1819 -0.1509 0.2135 -0.0845 -0.2021 0.2192 -0.1893 -0.1716 -0.0903 -0.0898 -0.1577 0.0953 0.0886 0.1030 0.0886 0.0894 0.1050 0.0970 0.0762 0.1032 0.1221 0.1315 0.1052 0.1264 0.1288 0.1272 0.1290 0.1270 0.1336 0.1256
va: 1.2794 1.2495 2.1228 2.1388 2.1181 3.1214 3.8125 3.8192 3.8328 3.9063 3.9150 3.8926 4.2524 4.2131 3.8428 3.6703 4.0199 3.9350 4.0282 3.8665 3.9577 4.0356 3.8764 4.0390 3.9797 3.9229 3.8776 3.9993 1.0432 1.0316 1.0216 1.0023 1.0010 0.9998 1.0051 1.0070 1.0303 1.0197 1.0233 1.0139 0.9997 1.0119 1.0119 1.0153 0.9988 1.0148 1.0014
dispcorr: -0.026760862 hartree
energy: -2050.687844280405
dipole: 6.03758 -7.11105 -1.07347 -14.97257 14.27861 -0.69397 -10.10141 10.61695 0.51555
magnitude: 1.37831 au
magnitude: 3.50338 debye
