program: Orca
programVersion: 5.0.2
elementType: Cl Cl O O O N C C C C C C C C C C C C C C C C C C C C C C H H H H H H H H H H H H H H H H H H H
charge: 0
multiplicity: 1
keywords: wb97x-d3
keywords: def2-TZVPP
keywords: def2/J RIJCOSX
keywords: DEFGRID2
keywords: scfconv7
keywords: smallprint printgap noloewdin
keywords: NOSOSCF
formula: C22H19Cl2NO3
InChI: InChI=1/C22H19Cl2NO3/c1-22(2)17(12-19(23)24)20(22)21(26)28-18(13-25)14-7-6-10-16(11-14)27-15-8-4-3-5-9-15/h3-12,17-18,20H,1-2H3
47 atoms
Cl -4.429595 -0.638125 -1.280511
Cl -4.287019 -2.010348 -3.812995
O  1.64667 -1.787268 0.171076
O  -0.100243 -0.889552 1.247891
O  1.617279 3.858471 -0.001768
N  4.758545 -2.212305 1.189894
C  -1.426742 -3.588539 0.247331
C  -1.939515 -2.396741 -0.506444
C  -0.446729 -2.613637 -0.376705
C  -1.632809 -3.617827 1.741767
C  -1.485004 -4.960692 -0.38135
C  -2.570749 -2.510053 -1.8269
C  0.336461 -1.664907 0.442243
C  -3.620515 -1.810521 -2.240709
C  2.531907 -0.892001 0.840652
C  2.730638 0.367784 0.035596
C  3.77938 -1.635644 1.025093
C  2.092605 1.531749 0.44381
C  3.489839 0.346677 -1.126767
C  2.227979 2.687809 -0.316192
C  3.607737 1.503564 -1.879857
C  2.985422 2.67389 -1.4809
C  1.223572 4.086498 1.290682
C  -0.127045 4.243983 1.553184
C  2.164731 4.203256 2.304669
C  -0.539183 4.531263 2.846667
C  1.740208 4.483731 3.593495
C  0.389674 4.648375 3.869074
H  -2.324065 -1.601478 0.121677
H  0.077091 -2.986227 -1.249782
H  -0.854311 -4.209429 2.227103
H  -2.591994 -4.08583 1.96853
H  -1.633935 -2.628076 2.191822
H  -1.250424 -4.958118 -1.445119
H  -2.479166 -5.394135 -0.262388
H  -0.770492 -5.627246 0.103259
H  -2.154271 -3.214199 -2.536462
H  2.144328 -0.64238 1.832779
H  1.482135 1.52699 1.337817
H  3.993691 -0.558927 -1.439507
H  4.200405 1.498672 -2.784641
H  3.081312 3.58053 -2.063609
H  -0.84416 4.146178 0.748885
H  3.217985 4.082767 2.084672
H  -1.593408 4.657441 3.054063
H  2.470948 4.579818 4.385537
H  0.064557 4.870725 4.876326
totalener: -2050.66194026 hartree
nucrepener: 2728.01304124 hartree
electener: -4778.67498149 hartree
oneelecener: -8231.41285795 hartree
twoeener: 3452.73787645 hartree
kineticenergy: 2044.53280060 hartree
xcener: -151.869923717868 hartree
chargesum: 0.0000000
charge: -0.040098 -0.044923 -0.256301 -0.383466 -0.294761 -0.003456 0.061129 0.043770 -0.090448 -0.248437 -0.245446 -0.203838 0.365120 0.053565 0.309494 -0.019692 -0.254737 -0.105561 -0.182046 0.210352 -0.090878 -0.194048 0.200847 -0.166561 -0.149591 -0.108146 -0.121419 -0.124713 0.086109 0.080222 0.090421 0.091599 0.099816 0.073701 0.100183 0.096560 0.096707 0.118340 0.128269 0.120334 0.128871 0.128502 0.127061 0.133457 0.127348 0.129095 0.127692
qa: -0.0401 -0.0449 -0.2563 -0.3835 -0.2948 -0.0035 0.0611 0.0438 -0.0904 -0.2484 -0.2454 -0.2038 0.3651 0.0536 0.3095 -0.0197 -0.2547 -0.1056 -0.1820 0.2104 -0.0909 -0.1940 0.2008 -0.1666 -0.1496 -0.1081 -0.1214 -0.1247 0.0861 0.0802 0.0904 0.0916 0.0998 0.0737 0.1002 0.0966 0.0967 0.1183 0.1283 0.1203 0.1289 0.1285 0.1271 0.1335 0.1273 0.1291 0.1277
va: 1.2870 1.2601 2.1352 2.1170 2.1132 3.1172 3.7735 3.8154 3.8551 3.9163 3.9096 3.9284 4.2462 4.2491 3.8307 3.7103 4.0202 3.8654 4.0470 3.8776 3.9519 4.0375 3.8475 4.0296 3.9793 3.9422 3.9481 3.9482 1.0518 1.0349 1.0017 1.0017 1.0200 1.0100 1.0022 1.0042 1.0311 1.0242 1.0245 1.0158 0.9994 1.0124 1.0116 1.0036 0.9994 0.9996 0.9997
dispcorr: -0.022955110 hartree
energy: -2050.684895367219
dipole: 15.78981 -16.42631 -0.63650 -3.06448 3.09641 0.03193 19.44613 -19.37665 0.06947
magnitude: 0.64108 au
magnitude: 1.62950 debye
