program: Orca
programVersion: 5.0.2
elementType: Cl Cl O O O N C C C C C C C C C C C C C C C C C C C C C C H H H H H H H H H H H H H H H H H H H
charge: 0
multiplicity: 1
keywords: wb97x-d3
keywords: def2-TZVPP
keywords: def2/J RIJCOSX
keywords: DEFGRID2
keywords: scfconv7
keywords: smallprint printgap noloewdin
keywords: NOSOSCF
formula: C22H19Cl2NO3
InChI: InChI=1/C22H19Cl2NO3/c1-22(2)17(12-19(23)24)20(22)21(26)28-18(13-25)14-7-6-10-16(11-14)27-15-8-4-3-5-9-15/h3-12,17-18,20H,1-2H3
47 atoms
Cl -1.691095 -0.067102 1.045824
Cl -4.571904 -0.298809 1.040422
O  1.220738 -1.604338 -1.105736
O  1.305296 -2.93705 0.690696
O  0.606558 3.335442 0.523897
N  3.573673 -0.104508 -2.903866
C  -1.360724 -4.133724 -0.463907
C  -1.651536 -3.094899 0.564015
C  -0.715032 -2.764682 -0.57971
C  -0.545597 -5.341234 -0.070001
C  -2.40804 -4.429952 -1.511198
C  -2.951763 -2.397116 0.663789
C  0.691723 -2.487991 -0.238892
C  -3.057334 -1.093163 0.88737
C  2.466044 -1.028728 -0.726828
C  2.243589 0.072182 0.281372
C  3.070033 -0.518299 -1.958682
C  1.560492 1.218606 -0.106077
C  2.645821 -0.09764 1.597449
C  1.298536 2.207064 0.830998
C  2.36667 0.892269 2.52805
C  1.699371 2.044767 2.152043
C  0.825509 3.976978 -0.663521
C  -0.276381 4.54191 -1.288201
C  2.096065 4.119199 -1.207047
C  -0.102558 5.259029 -2.461654
C  2.252396 4.828635 -2.387431
C  1.159053 5.402058 -3.019408
H  -1.142857 -3.236392 1.514596
H  -1.117745 -2.130865 -1.36089
H  -1.21022 -6.134273 0.277024
H  0.165688 -5.131157 0.724233
H  0.009868 -5.728603 -0.925743
H  -3.116928 -5.175488 -1.145892
H  -1.943871 -4.831594 -2.412749
H  -2.975474 -3.544541 -1.799448
H  -3.866332 -2.973134 0.586145
H  3.136976 -1.787685 -0.313022
H  1.238913 1.344419 -1.133475
H  3.156925 -1.002045 1.898184
H  2.674103 0.765739 3.557205
H  1.48313 2.822547 2.872287
H  -1.258214 4.421606 -0.849649
H  2.958584 3.685056 -0.718178
H  -0.963325 5.700843 -2.945905
H  3.241826 4.934504 -2.811775
H  1.289955 5.955398 -3.9392
totalener: -2050.65932813 hartree
nucrepener: 2871.85404494 hartree
electener: -4922.51337306 hartree
oneelecener: -8519.46702313 hartree
twoeener: 3596.95365007 hartree
kineticenergy: 2044.54478153 hartree
xcener: -151.873099811246 hartree
chargesum: 0.0000000
charge: -0.031654 -0.041304 -0.259717 -0.382218 -0.296887 -0.001399 0.122322 -0.027212 -0.134539 -0.250773 -0.269179 -0.252657 0.347639 0.105521 0.352173 0.050088 -0.271449 -0.239706 -0.127857 0.200908 -0.092013 -0.183612 0.248742 -0.217905 -0.159445 -0.085498 -0.107367 -0.146221 0.112407 0.106424 0.085098 0.102223 0.089893 0.093941 0.097561 0.087257 0.119670 0.119985 0.129287 0.115997 0.128585 0.129810 0.125489 0.129387 0.124596 0.128232 0.125379
qa: -0.0317 -0.0413 -0.2597 -0.3822 -0.2969 -0.0014 0.1223 -0.0272 -0.1345 -0.2508 -0.2692 -0.2527 0.3476 0.1055 0.3522 0.0501 -0.2714 -0.2397 -0.1279 0.2009 -0.0920 -0.1836 0.2487 -0.2179 -0.1594 -0.0855 -0.1074 -0.1462 0.1124 0.1064 0.0851 0.1022 0.0899 0.0939 0.0976 0.0873 0.1197 0.1200 0.1293 0.1160 0.1286 0.1298 0.1255 0.1294 0.1246 0.1282 0.1254
va: 1.3209 1.2650 2.1323 2.1160 2.1046 3.1185 3.7231 3.8517 3.8663 3.8996 3.9146 3.9182 4.2098 4.2016 3.8159 3.5877 4.0320 3.9668 3.9913 3.8084 3.9572 4.0387 3.7988 4.0439 3.9391 3.9314 3.9572 3.9657 1.0251 1.0253 1.0026 1.0204 1.0019 1.0011 1.0061 1.0009 1.0166 1.0198 1.0190 1.0195 0.9993 1.0106 1.0149 1.0058 0.9989 1.0000 1.0005
dispcorr: -0.026431361 hartree
energy: -2050.685759490414
dipole: 9.55120 -10.34702 -0.79583 -12.29913 11.55809 -0.74104 -8.99317 9.54378 0.55060
magnitude: 1.21887 au
magnitude: 3.09813 debye
