program: Orca
programVersion: 5.0.2
elementType: Cl Cl O O O N C C C C C C C C C C C C C C C C C C C C C C H H H H H H H H H H H H H H H H H H H
charge: 0
multiplicity: 1
keywords: wb97x-d3
keywords: def2-TZVPP
keywords: def2/J RIJCOSX
keywords: DEFGRID2
keywords: scfconv7
keywords: smallprint printgap noloewdin
keywords: NOSOSCF
formula: C22H19Cl2NO3
InChI: InChI=1/C22H19Cl2NO3/c1-22(2)17(12-19(23)24)20(22)21(26)28-18(13-25)14-7-6-10-16(11-14)27-15-8-4-3-5-9-15/h3-12,17-18,20H,1-2H3
47 atoms
Cl -2.945903 -4.120447 2.93795
Cl -5.244372 -2.491411 2.316806
O  0.901151 -0.743426 -1.072536
O  1.171324 -2.465446 0.337446
O  1.963075 4.304132 0.57566
N  3.097399 0.396523 -3.274766
C  -1.482386 -3.364906 -1.132336
C  -1.742294 -2.95142 0.287899
C  -0.972942 -2.028082 -0.628268
C  -0.529987 -4.510778 -1.371927
C  -2.598892 -3.304649 -2.146778
C  -3.078495 -2.556439 0.752316
C  0.46476 -1.803125 -0.372068
C  -3.667536 -2.998081 1.856774
C  2.272867 -0.380481 -0.920587
C  2.42466 0.694861 0.125029
C  2.722736 0.057446 -2.243488
C  2.126069 2.016226 -0.19075
C  2.807307 0.341818 1.409231
C  2.2210 2.990563 0.792163
C  2.896825 1.32738 2.38352
C  2.607593 2.644507 2.084455
C  1.521234 4.702003 -0.661012
C  0.164566 4.675752 -0.944891
C  2.437281 5.151544 -1.598191
C  -0.277022 5.112614 -2.184601
C  1.984189 5.587446 -2.834464
C  0.629599 5.566818 -3.131541
H  -1.128363 -3.460205 1.02233
H  -1.498023 -1.162306 -1.016225
H  0.234437 -4.598814 -0.603525
H  -0.029476 -4.403254 -2.336213
H  -1.086846 -5.448876 -1.393099
H  -2.188014 -3.256082 -3.156152
H  -3.248841 -2.439856 -2.019948
H  -3.22186 -4.198076 -2.082144
H  -3.643063 -1.851446 0.154741
H  2.867469 -1.254492 -0.639618
H  1.836043 2.279615 -1.200429
H  3.023805 -0.689875 1.651588
H  3.196258 1.064074 3.389001
H  2.680627 3.415018 2.840695
H  -0.535538 4.322602 -0.198812
H  3.492479 5.161934 -1.358324
H  -1.335056 5.097264 -2.410022
H  2.695565 5.939411 -3.56936
H  0.281007 5.906111 -4.097519
totalener: -2050.66212134 hartree
nucrepener: 2702.65554843 hartree
electener: -4753.31766977 hartree
oneelecener: -8180.74427377 hartree
twoeener: 3427.42660400 hartree
kineticenergy: 2044.53886771 hartree
xcener: -151.871171401891 hartree
chargesum: 0.0000000
charge: -0.039064 -0.044646 -0.257360 -0.382803 -0.294674 -0.003881 0.065966 0.044673 -0.100485 -0.250865 -0.238636 -0.203304 0.365131 0.050160 0.312441 -0.019300 -0.259722 -0.172059 -0.148955 0.239831 -0.084085 -0.201045 0.188346 -0.145765 -0.139597 -0.126759 -0.118942 -0.109730 0.087636 0.078978 0.100302 0.091781 0.091195 0.096953 0.071023 0.099258 0.097544 0.122175 0.122012 0.124352 0.127631 0.127008 0.126747 0.127377 0.127333 0.128380 0.127445
qa: -0.0391 -0.0446 -0.2574 -0.3828 -0.2947 -0.0039 0.0660 0.0447 -0.1005 -0.2509 -0.2386 -0.2033 0.3651 0.0502 0.3124 -0.0193 -0.2597 -0.1721 -0.1490 0.2398 -0.0841 -0.2010 0.1883 -0.1458 -0.1396 -0.1268 -0.1189 -0.1097 0.0876 0.0790 0.1003 0.0918 0.0912 0.0970 0.0710 0.0993 0.0975 0.1222 0.1220 0.1244 0.1276 0.1270 0.1267 0.1274 0.1273 0.1284 0.1274
va: 1.2881 1.2609 2.1327 2.1197 2.1198 3.1157 3.7675 3.8134 3.8707 3.9164 3.9084 3.9180 4.2472 4.2451 3.8170 3.7565 4.0347 3.9914 3.9775 3.8647 3.9560 4.0392 3.8642 3.9948 4.0077 3.9487 3.9551 3.9400 1.0504 1.0363 1.0192 1.0012 1.0020 1.0041 1.0102 1.0031 1.0291 1.0249 1.0223 1.0188 0.9993 1.0135 1.0075 1.0082 0.9999 1.0001 1.0000
dispcorr: -0.023048495 hartree
energy: -2050.685169835493
dipole: 14.21549 -14.82486 -0.60937 9.54739 -9.40025 0.14714 -22.77270 22.70207 -0.07063
magnitude: 0.63085 au
magnitude: 1.60349 debye
