program: Orca
programVersion: 5.0.2
elementType: Cl Cl O O O N C C C C C C C C C C C C C C C C C C C C C C H H H H H H H H H H H H H H H H H H H
charge: 0
multiplicity: 1
keywords: wb97x-d3
keywords: def2-TZVPP
keywords: def2/J RIJCOSX
keywords: DEFGRID2
keywords: scfconv7
keywords: smallprint printgap noloewdin
keywords: NOSOSCF
formula: C22H19Cl2NO3
InChI: InChI=1/C22H19Cl2NO3/c1-22(2)17(12-19(23)24)20(22)21(26)28-18(13-25)14-7-6-10-16(11-14)27-15-8-4-3-5-9-15/h3-12,17-18,20H,1-2H3
47 atoms
Cl -3.535298 -1.361753 -2.37039
Cl -4.728468 -3.912287 -1.748874
O  1.12328 -1.108849 -0.617326
O  2.087796 -2.834618 0.430532
O  2.400595 3.588028 1.616596
N  2.064899 0.720187 -3.20046
C  -1.185379 -1.726308 1.372714
C  -1.526898 -2.046528 -0.055352
C  -0.263016 -2.611073 0.558531
C  -0.800997 -0.303874 1.702353
C  -1.925501 -2.406738 2.499647
C  -2.611744 -2.968411 -0.418101
C  1.100157 -2.220013 0.137789
C  -3.500551 -2.766526 -1.383546
C  2.406026 -0.597364 -0.971449
C  2.956759 0.289618 0.118162
C  2.20326 0.137382 -2.220949
C  2.397603 1.545806 0.327675
C  3.982313 -0.171689 0.928485
C  2.871185 2.340329 1.361524
C  4.457158 0.639823 1.949658
C  3.905729 1.88725 2.174334
C  1.149111 3.93743 1.183726
C  1.027626 5.004644 0.309564
C  0.025473 3.264912 1.645189
C  -0.23496 5.404635 -0.104101
C  -1.228958 3.665463 1.214697
C  -1.364562 4.734666 0.340184
H  -1.377279 -1.225886 -0.746225
H  -0.28901 -3.658026 0.840232
H  -0.064667 -0.27699 2.508408
H  -1.684366 0.241115 2.040033
H  -0.389878 0.23922 0.855451
H  -2.874782 -1.904806 2.693128
H  -1.334581 -2.367609 3.415812
H  -2.141212 -3.455598 2.300445
H  -2.699508 -3.89739 0.13152
H  3.101848 -1.417691 -1.170084
H  1.611146 1.907491 -0.324139
H  4.40096 -1.156392 0.771826
H  5.260569 0.290791 2.584092
H  4.2709 2.521192 2.971507
H  1.915424 5.516042 -0.038081
H  0.13241 2.439373 2.337555
H  -0.331917 6.239361 -0.785373
H  -2.106232 3.14128 1.570262
H  -2.34651 5.04472 0.009838
totalener: -2050.65850001 hartree
nucrepener: 2819.18954984 hartree
electener: -4869.84804985 hartree
oneelecener: -8413.40540496 hartree
twoeener: 3543.55735511 hartree
kineticenergy: 2044.53841109 hartree
xcener: -151.872556213160 hartree
chargesum: 0.0000000
charge: -0.036762 -0.043560 -0.261263 -0.352418 -0.297178 0.000463 0.083858 0.074899 -0.101454 -0.287536 -0.246528 -0.227861 0.350552 0.055659 0.285544 0.026427 -0.261246 -0.224317 -0.137814 0.236864 -0.089275 -0.200707 0.229021 -0.167946 -0.192045 -0.106318 -0.114950 -0.124798 0.089750 0.082919 0.105120 0.095038 0.092478 0.097826 0.096850 0.074720 0.096373 0.127335 0.137414 0.120729 0.129018 0.129330 0.127707 0.147277 0.128663 0.124263 0.127878
qa: -0.0368 -0.0436 -0.2613 -0.3524 -0.2972 0.0005 0.0839 0.0749 -0.1015 -0.2875 -0.2465 -0.2279 0.3506 0.0557 0.2855 0.0264 -0.2612 -0.2243 -0.1378 0.2369 -0.0893 -0.2007 0.2290 -0.1679 -0.1920 -0.1063 -0.1149 -0.1248 0.0898 0.0829 0.1051 0.0950 0.0925 0.0978 0.0968 0.0747 0.0964 0.1273 0.1374 0.1207 0.1290 0.1293 0.1277 0.1473 0.1287 0.1243 0.1279
va: 1.2908 1.2621 2.1130 2.1514 2.1209 3.1130 3.7930 3.7776 3.8760 3.9225 3.9109 3.9290 4.2755 4.2532 3.8602 3.6309 4.0282 3.9448 4.0049 3.8604 3.9568 4.0368 3.8193 4.0310 3.9669 3.9435 3.9486 3.9689 1.0392 1.0333 0.9970 0.9996 1.0072 1.0029 1.0030 1.0107 1.0314 1.0181 1.0112 1.0206 0.9990 1.0119 1.0113 0.9907 0.9990 1.0023 0.9999
dispcorr: -0.026645725 hartree
energy: -2050.685145738213
dipole: 14.23170 -14.50695 -0.27525 14.56066 -14.51665 0.04401 25.90939 -24.23338 1.67601
magnitude: 1.69903 au
magnitude: 4.31860 debye
