program: Orca
programVersion: 5.0.2
elementType: Cl Cl O O O N C C C C C C C C C C C C C C C C C C C C C C H H H H H H H H H H H H H H H H H H H
charge: 0
multiplicity: 1
keywords: wb97x-d3
keywords: def2-TZVPP
keywords: def2/J RIJCOSX
keywords: DEFGRID2
keywords: scfconv7
keywords: smallprint printgap noloewdin
keywords: NOSOSCF
formula: C22H19Cl2NO3
InChI: InChI=1/C22H19Cl2NO3/c1-22(2)17(12-19(23)24)20(22)21(26)28-18(13-25)14-7-6-10-16(11-14)27-15-8-4-3-5-9-15/h3-12,17-18,20H,1-2H3
47 atoms
Cl -2.775182 -0.53639 3.002016
Cl -4.645606 0.441078 1.036008
O  1.677507 -1.657041 -1.152352
O  1.42632 -2.39055 0.946486
O  1.911668 3.345965 -0.073254
N  4.24447 -1.180462 -3.187052
C  -1.333468 -3.413398 -0.159666
C  -1.518927 -2.131022 0.595852
C  -0.47443 -2.21489 -0.503126
C  -0.757046 -4.590321 0.589504
C  -2.339283 -3.822949 -1.209827
C  -2.684163 -1.260174 0.40706
C  0.948287 -2.116971 -0.118709
C  -3.279858 -0.555111 1.36156
C  3.039272 -1.365537 -0.876555
C  3.193473 -0.079769 -0.09871
C  3.694742 -1.264754 -2.182349
C  2.451666 1.033461 -0.471663
C  4.076116 -0.017159 0.966236
C  2.590714 2.213573 0.244234
C  4.226073 1.176509 1.656718
C  3.483835 2.289951 1.30715
C  0.661441 3.255183 -0.623798
C  -0.347733 2.523977 -0.009428
C  0.412493 3.966199 -1.786725
C  -1.615082 2.513654 -0.570045
C  -0.862082 3.952526 -2.334389
C  -1.877911 3.227031 -1.731366
H  -1.103611 -2.137874 1.596926
H  -0.715695 -1.727804 -1.441157
H  -0.217674 -5.253487 -0.088992
H  -1.567709 -5.166458 1.037917
H  -0.077036 -4.298523 1.385281
H  -3.209308 -4.290209 -0.746299
H  -1.89481 -4.5497 -1.890883
H  -2.692766 -2.990564 -1.817195
H  -3.10221 -1.171615 -0.588031
H  3.509057 -2.186502 -0.324793
H  1.772251 0.983419 -1.31369
H  4.637286 -0.893464 1.26326
H  4.912984 1.23407 2.490097
H  3.585119 3.219486 1.851326
H  -0.151412 1.975897 0.903505
H  1.211445 4.529922 -2.249941
H  -2.405688 1.956562 -0.085622
H  -1.057321 4.511073 -3.24015
H  -2.871167 3.221072 -2.159322
totalener: -2050.66141879 hartree
nucrepener: 2865.02169607 hartree
electener: -4915.68311485 hartree
oneelecener: -8505.09960380 hartree
twoeener: 3589.41648895 hartree
kineticenergy: 2044.53796821 hartree
xcener: -151.872543787945 hartree
chargesum: 0.0000000
charge: -0.036502 -0.053137 -0.270626 -0.363543 -0.298020 0.000907 0.060410 0.068624 -0.074925 -0.247390 -0.247446 -0.237308 0.321347 0.065770 0.312963 0.054011 -0.253351 -0.169316 -0.151906 0.195372 -0.087570 -0.197031 0.245821 -0.200685 -0.205633 -0.071449 -0.076534 -0.175640 0.089268 0.083008 0.088651 0.090461 0.102326 0.100520 0.096230 0.075074 0.101278 0.123090 0.133516 0.106282 0.127194 0.129863 0.131319 0.127713 0.134491 0.127047 0.125457
qa: -0.0365 -0.0531 -0.2706 -0.3635 -0.2980 0.0009 0.0604 0.0686 -0.0749 -0.2474 -0.2474 -0.2373 0.3213 0.0658 0.3130 0.0540 -0.2534 -0.1693 -0.1519 0.1954 -0.0876 -0.1970 0.2458 -0.2007 -0.2056 -0.0714 -0.0765 -0.1756 0.0893 0.0830 0.0887 0.0905 0.1023 0.1005 0.0962 0.0751 0.1013 0.1231 0.1335 0.1063 0.1272 0.1299 0.1313 0.1277 0.1345 0.1270 0.1255
va: 1.2876 1.2491 2.1190 2.1397 2.1138 3.1206 3.7973 3.7794 3.8371 3.9146 3.9104 3.9314 4.2621 4.2008 3.8413 3.6588 4.0183 3.9305 4.0310 3.8757 3.9581 4.0360 3.8081 3.9795 4.0459 3.8625 3.9174 3.9998 1.0489 1.0352 1.0022 1.0012 1.0212 1.0020 1.0044 1.0096 1.0295 1.0200 1.0211 1.0132 0.9997 1.0110 1.0090 1.0128 1.0074 0.9984 1.0020
dispcorr: -0.026217605 hartree
energy: -2050.687636392263
dipole: 8.14130 -9.12713 -0.98583 -11.95719 11.43577 -0.52142 -11.32548 11.74388 0.41839
magnitude: 1.19113 au
magnitude: 3.02761 debye
