program: Orca
programVersion: 5.0.2
elementType: Cl Cl O O O N C C C C C C C C C C C C C C C C C C C C C C H H H H H H H H H H H H H H H H H H H
charge: 0
multiplicity: 1
keywords: wb97x-d3
keywords: def2-TZVPP
keywords: def2/J RIJCOSX
keywords: DEFGRID2
keywords: scfconv7
keywords: smallprint printgap noloewdin
keywords: NOSOSCF
formula: C22H19Cl2NO3
InChI: InChI=1/C22H19Cl2NO3/c1-22(2)17(12-19(23)24)20(22)21(26)28-18(13-25)14-7-6-10-16(11-14)27-15-8-4-3-5-9-15/h3-12,17-18,20H,1-2H3
47 atoms
Cl -1.745154 -1.005523 -2.386721
Cl -3.441734 -2.695724 -4.008307
O  1.178253 -1.871456 0.313564
O  -0.552681 -1.243628 1.583623
O  0.543048 3.982422 0.662635
N  4.42647 -1.230394 0.341031
C  -1.719232 -4.052137 0.737719
C  -2.28658 -2.96907 -0.113344
C  -0.78494 -3.071445 0.049798
C  -1.93922 -3.992936 2.229114
C  -1.678841 -5.459347 0.189997
C  -2.89004 -3.225644 -1.439406
C  -0.092195 -1.975366 0.752092
C  -2.714501 -2.419438 -2.478386
C  1.89534 -0.730901 0.756163
C  1.478112 0.512999 0.005746
C  3.309157 -1.030181 0.516321
C  1.208431 1.675272 0.706499
C  1.365271 0.4819 -1.380068
C  0.845658 2.82504 0.013867
C  0.976073 1.625736 -2.055274
C  0.723408 2.802783 -1.365815
C  1.387054 4.461854 1.623911
C  0.81102 5.186348 2.658202
C  2.764908 4.289985 1.565752
C  1.620044 5.742523 3.636132
C  3.559958 4.843576 2.557954
C  2.996125 5.570151 3.595798
H  -2.726805 -2.137284 0.431464
H  -0.237128 -3.476581 -0.793007
H  -1.130854 -4.497043 2.760769
H  -2.868942 -4.505234 2.481854
H  -2.007105 -2.976138 2.606484
H  -1.491756 -5.487845 -0.88387
H  -2.624741 -5.971713 0.376453
H  -0.890821 -6.035812 0.676101
H  -3.527842 -4.091608 -1.571752
H  1.761411 -0.577454 1.832107
H  1.271269 1.689693 1.787874
H  1.577109 -0.426098 -1.929239
H  0.882741 1.608604 -3.132789
H  0.429353 3.702313 -1.889977
H  -0.263201 5.313588 2.686376
H  3.220891 3.736912 0.754779
H  1.167852 6.30913 4.439482
H  4.632344 4.70709 2.510389
H  3.623771 6.001135 4.363917
totalener: -2050.65907970 hartree
nucrepener: 2789.40147185 hartree
electener: -4840.06055155 hartree
oneelecener: -8354.24297810 hartree
twoeener: 3514.18242655 hartree
kineticenergy: 2044.53792605 hartree
xcener: -151.871387034527 hartree
chargesum: -0.0000000
charge: -0.034028 -0.039059 -0.262155 -0.367700 -0.298488 -0.000929 0.116862 -0.026929 -0.128351 -0.249061 -0.270043 -0.250791 0.332366 0.101872 0.314687 0.097033 -0.253005 -0.139573 -0.264261 0.192250 -0.092516 -0.168873 0.242218 -0.213764 -0.158539 -0.087354 -0.121825 -0.148601 0.114948 0.102933 0.089363 0.086343 0.102618 0.086848 0.095337 0.097611 0.119644 0.118373 0.117815 0.136544 0.136469 0.131243 0.126205 0.134460 0.125595 0.129821 0.126391
qa: -0.0340 -0.0391 -0.2622 -0.3677 -0.2985 -0.0009 0.1169 -0.0269 -0.1284 -0.2491 -0.2700 -0.2508 0.3324 0.1019 0.3147 0.0970 -0.2530 -0.1396 -0.2643 0.1922 -0.0925 -0.1689 0.2422 -0.2138 -0.1585 -0.0874 -0.1218 -0.1486 0.1149 0.1029 0.0894 0.0863 0.1026 0.0868 0.0953 0.0976 0.1196 0.1184 0.1178 0.1365 0.1365 0.1312 0.1262 0.1345 0.1256 0.1298 0.1264
va: 1.3133 1.2675 2.1175 2.1350 2.1088 3.1210 3.7392 3.8453 3.8594 3.8996 3.9133 3.9257 4.2153 4.2014 3.8389 3.5586 4.0181 3.9959 3.9940 3.8888 3.8941 4.0372 3.8034 4.0335 3.9209 3.9371 3.9600 3.9638 1.0244 1.0255 1.0022 1.0026 1.0202 1.0008 1.0005 1.0066 1.0158 1.0232 1.0142 1.0200 0.9976 1.0091 1.0140 1.0047 0.9985 0.9996 1.0002
dispcorr: -0.025441576 hartree
energy: -2050.684521275372
dipole: 6.73916 -7.86722 -1.12806 -1.38948 0.95242 -0.43707 25.41497 -25.13196 0.28301
magnitude: 1.24244 au
magnitude: 3.15802 debye
