program: Orca
programVersion: 5.0.2
elementType: Cl Cl O O O N C C C C C C C C C C C C C C C C C C C C C C H H H H H H H H H H H H H H H H H H H
charge: 0
multiplicity: 1
keywords: wb97x-d3
keywords: def2-TZVPP
keywords: def2/J RIJCOSX
keywords: DEFGRID2
keywords: scfconv7
keywords: smallprint printgap noloewdin
keywords: NOSOSCF
formula: C22H19Cl2NO3
InChI: InChI=1/C22H19Cl2NO3/c1-22(2)17(12-19(23)24)20(22)21(26)28-18(13-25)14-7-6-10-16(11-14)27-15-8-4-3-5-9-15/h3-12,17-18,20H,1-2H3
47 atoms
Cl -3.977873 -3.412779 2.202503
Cl -5.728891 -2.355539 0.168563
O  1.334394 -1.431952 -1.08888
O  0.97832 -2.394998 0.902033
O  1.385493 3.805053 -1.074726
N  4.165866 -0.736109 -2.658195
C  -0.986043 -4.117524 -0.881692
C  -1.739463 -3.177151 0.014739
C  -0.626071 -2.644001 -0.857968
C  -0.081548 -5.139903 -0.237266
C  -1.636152 -4.619961 -2.148347
C  -3.125849 -2.777756 -0.269034
C  0.618428 -2.166104 -0.219957
C  -4.135152 -2.842143 0.590853
C  2.551027 -0.866434 -0.608776
C  2.311796 0.487795 0.009422
C  3.443034 -0.7932 -1.76765
C  1.997635 1.571639 -0.797973
C  2.364802 0.632016 1.388815
C  1.732771 2.806124 -0.223392
C  2.105089 1.871802 1.951419
C  1.786616 2.961841 1.158224
C  1.575533 5.11118 -0.713141
C  2.832659 5.584496 -0.360235
C  0.486054 5.965778 -0.763646
C  2.990058 6.927216 -0.055421
C  0.659167 7.309758 -0.466007
C  1.907553 7.794201 -0.107211
H  -1.484484 -3.256628 1.065538
H  -0.914293 -2.087509 -1.743027
H  0.747293 -5.395707 -0.900387
H  -0.644333 -6.055066 -0.046753
H  0.334789 -4.805209 0.709714
H  -0.876478 -4.953967 -2.856388
H  -2.23813 -3.864459 -2.651922
H  -2.286811 -5.468236 -1.930894
H  -3.359166 -2.399205 -1.256533
H  3.016474 -1.529867 0.12614
H  1.961448 1.474336 -1.876552
H  2.593187 -0.217553 2.017964
H  2.14066 1.992461 3.025739
H  1.576899 3.920066 1.61471
H  3.681071 4.912546 -0.332948
H  -0.484832 5.578552 -1.043273
H  3.969242 7.298748 0.215957
H  -0.190392 7.97811 -0.510603
H  2.038472 8.842205 0.125794
totalener: -2050.66186338 hartree
nucrepener: 2652.66564107 hartree
electener: -4703.32750445 hartree
oneelecener: -8080.67603819 hartree
twoeener: 3377.34853374 hartree
kineticenergy: 2044.52812711 hartree
xcener: -151.869057146322 hartree
chargesum: -0.0000000
charge: -0.039166 -0.043976 -0.259793 -0.381907 -0.294088 -0.002426 0.064965 0.042985 -0.102333 -0.251075 -0.235089 -0.199657 0.362546 0.046016 0.326121 0.003058 -0.262815 -0.198235 -0.125068 0.201075 -0.118479 -0.149217 0.212847 -0.153152 -0.183742 -0.118693 -0.104605 -0.130103 0.088638 0.080579 0.091118 0.090936 0.100702 0.096569 0.072071 0.099086 0.099484 0.120405 0.120872 0.119920 0.130483 0.134360 0.137405 0.126775 0.129322 0.127307 0.127975
qa: -0.0392 -0.0440 -0.2598 -0.3819 -0.2941 -0.0024 0.0650 0.0430 -0.1023 -0.2511 -0.2351 -0.1997 0.3625 0.0460 0.3261 0.0031 -0.2628 -0.1982 -0.1251 0.2011 -0.1185 -0.1492 0.2128 -0.1532 -0.1837 -0.1187 -0.1046 -0.1301 0.0886 0.0806 0.0911 0.0909 0.1007 0.0966 0.0721 0.0991 0.0995 0.1204 0.1209 0.1199 0.1305 0.1344 0.1374 0.1268 0.1293 0.1273 0.1280
va: 1.2882 1.2617 2.1359 2.1210 2.1092 3.1175 3.7700 3.8149 3.8806 3.9158 3.9078 3.9088 4.2417 4.2447 3.8120 3.6953 4.0284 4.1038 3.9759 3.9031 3.9761 3.9329 3.8275 3.9623 4.0308 3.9430 3.9390 3.9500 1.0483 1.0367 1.0012 1.0025 1.0198 1.0044 1.0097 1.0035 1.0275 1.0213 1.0290 1.0198 1.0011 1.0049 1.0015 1.0122 0.9996 0.9991 0.9997
dispcorr: -0.022566328 hartree
energy: -2050.684429712760
dipole: 22.54644 -23.01911 -0.47268 8.64639 -8.21810 0.42829 -7.46863 8.01583 0.54721
magnitude: 0.84041 au
magnitude: 2.13616 debye
