program: Orca
programVersion: 5.0.2
elementType: Cl Cl O O O N C C C C C C C C C C C C C C C C C C C C C C H H H H H H H H H H H H H H H H H H H
charge: 0
multiplicity: 1
keywords: wb97x-d3
keywords: def2-TZVPP
keywords: def2/J RIJCOSX
keywords: DEFGRID2
keywords: scfconv7
keywords: smallprint printgap noloewdin
keywords: NOSOSCF
formula: C22H19Cl2NO3
InChI: InChI=1/C22H19Cl2NO3/c1-22(2)17(12-19(23)24)20(22)21(26)28-18(13-25)14-7-6-10-16(11-14)27-15-8-4-3-5-9-15/h3-12,17-18,20H,1-2H3
47 atoms
Cl -1.402387 -0.336063 -1.33936
Cl -3.954826 -0.954483 -2.546168
O  1.754934 -2.407798 -0.347596
O  0.755423 -2.203833 1.644229
O  1.102921 2.7152 1.79707
N  4.885926 -2.009862 -1.349502
C  -1.298082 -4.28675 0.481759
C  -1.789204 -2.891816 0.302939
C  -0.396164 -3.255446 -0.170448
C  -1.019628 -4.78564 1.877971
C  -1.811568 -5.358972 -0.450032
C  -2.818085 -2.513094 -0.688901
C  0.730254 -2.58684 0.506541
C  -2.735568 -1.412943 -1.426686
C  2.752933 -1.476878 0.060387
C  2.263477 -0.068875 -0.179481
C  3.940235 -1.784847 -0.738281
C  1.935031 0.732806 0.898609
C  2.0624 0.38161 -1.481137
C  1.402734 2.001128 0.682761
C  1.530717 1.640888 -1.682824
C  1.193889 2.45813 -0.611276
C  0.633857 3.996261 1.661688
C  1.530423 5.047247 1.543535
C  -0.732927 4.224711 1.677448
C  1.04733 6.34317 1.443396
C  -1.205093 5.525424 1.579067
C  -0.318888 6.585644 1.45824
H  -1.794801 -2.288633 1.207685
H  -0.268722 -3.367046 -1.24071
H  -1.924896 -5.229515 2.295519
H  -0.692386 -3.998292 2.551973
H  -0.249702 -5.558693 1.864881
H  -2.749405 -5.775087 -0.076967
H  -1.094644 -6.177645 -0.523265
H  -1.990862 -4.987221 -1.459344
H  -3.698584 -3.134582 -0.801643
H  3.01147 -1.616192 1.114445
H  2.067802 0.379444 1.913069
H  2.319949 -0.242463 -2.327018
H  1.369531 2.001562 -2.689768
H  0.774938 3.438046 -0.795246
H  2.594558 4.84943 1.536866
H  -1.415974 3.390619 1.772953
H  1.743503 7.166494 1.354226
H  -2.271181 5.708732 1.595448
H  -0.691118 7.598244 1.381174
totalener: -2050.65882519 hartree
nucrepener: 2841.97221994 hartree
electener: -4892.63104513 hartree
oneelecener: -8459.58467503 hartree
twoeener: 3566.95362990 hartree
kineticenergy: 2044.54404054 hartree
xcener: -151.872510591275 hartree
chargesum: -0.0000000
charge: -0.031068 -0.043187 -0.255370 -0.381466 -0.291694 -0.003414 0.128539 -0.030548 -0.134107 -0.250213 -0.269871 -0.253482 0.347251 0.107076 0.333407 0.023944 -0.260971 -0.157103 -0.207466 0.245753 -0.151785 -0.142852 0.176728 -0.138264 -0.141549 -0.127920 -0.125408 -0.112743 0.112557 0.104309 0.084771 0.102309 0.089368 0.094242 0.097609 0.086673 0.119619 0.117982 0.114492 0.118152 0.130798 0.128569 0.130022 0.128678 0.129382 0.129231 0.129018
qa: -0.0311 -0.0432 -0.2554 -0.3815 -0.2917 -0.0034 0.1285 -0.0305 -0.1341 -0.2502 -0.2699 -0.2535 0.3473 0.1071 0.3334 0.0239 -0.2610 -0.1571 -0.2075 0.2458 -0.1518 -0.1429 0.1767 -0.1383 -0.1415 -0.1279 -0.1254 -0.1127 0.1126 0.1043 0.0848 0.1023 0.0894 0.0942 0.0976 0.0867 0.1196 0.1180 0.1145 0.1182 0.1308 0.1286 0.1300 0.1287 0.1294 0.1292 0.1290
va: 1.3265 1.2635 2.1305 2.1149 2.1149 3.1193 3.7185 3.8518 3.8680 3.8989 3.9130 3.9187 4.2101 4.1998 3.8205 3.6287 4.0246 4.0622 4.0073 3.8866 3.9467 3.9032 3.8644 3.9901 3.9997 3.9447 3.9449 3.9332 1.0259 1.0263 1.0023 1.0203 1.0022 1.0008 1.0063 1.0009 1.0167 1.0202 1.0336 1.0207 1.0024 1.0113 1.0062 1.0086 0.9996 0.9995 0.9995
dispcorr: -0.026284635 hartree
energy: -2050.685109828949
dipole: 2.09996 -3.72806 -1.62810 -5.30435 5.66448 0.36012 14.02639 -13.71710 0.30928
magnitude: 1.69589 au
magnitude: 4.31062 debye
