program: Orca
programVersion: 5.0.2
elementType: Cl Cl O O O N C C C C C C C C C C C C C C C C C C C C C C H H H H H H H H H H H H H H H H H H H
charge: 0
multiplicity: 1
keywords: wb97x-d3
keywords: def2-TZVPP
keywords: def2/J RIJCOSX
keywords: DEFGRID2
keywords: scfconv7
keywords: smallprint printgap noloewdin
keywords: NOSOSCF
formula: C22H19Cl2NO3
InChI: InChI=1/C22H19Cl2NO3/c1-22(2)17(12-19(23)24)20(22)21(26)28-18(13-25)14-7-6-10-16(11-14)27-15-8-4-3-5-9-15/h3-12,17-18,20H,1-2H3
47 atoms
Cl -4.661842 -1.772581 0.241066
Cl -5.115093 -2.133193 -2.585241
O  1.801934 -1.962323 -0.567612
O  0.460565 -1.698732 1.206818
O  1.822739 3.174928 1.748834
N  5.087073 -2.206337 -0.821724
C  -0.995383 -4.132821 -0.176396
C  -1.780264 -2.865899 -0.360224
C  -0.311994 -2.893077 -0.720991
C  -0.729852 -4.602085 1.233122
C  -1.17759 -5.271361 -1.15146
C  -2.777183 -2.718099 -1.430075
C  0.645386 -2.120608 0.098452
C  -4.015054 -2.265987 -1.270974
C  2.838313 -1.246056 0.099554
C  2.731342 0.238693 -0.142117
C  4.092655 -1.789602 -0.426415
C  2.31281 1.06353 0.888074
C  3.015793 0.768725 -1.396268
C  2.196032 2.432929 0.675401
C  2.892132 2.131107 -1.596974
C  2.487766 2.972923 -0.570385
C  1.326208 4.437015 1.561281
C  0.140712 4.638945 0.867279
C  2.010346 5.502888 2.122132
C  -0.35421 5.926127 0.731947
C  1.499349 6.785982 1.98825
C  0.322265 7.002824 1.288833
H  -2.004662 -2.338586 0.560102
H  -0.063492 -2.93269 -1.775793
H  0.202806 -5.167083 1.283634
H  -1.53459 -5.266269 1.55183
H  -0.670185 -3.787455 1.950322
H  -2.060665 -5.857355 -0.892436
H  -0.314166 -5.93722 -1.120394
H  -1.293609 -4.940607 -2.182824
H  -2.494471 -2.998576 -2.437233
H  2.811494 -1.449192 1.174345
H  2.068904 0.6551 1.860451
H  3.3474 0.128545 -2.203657
H  3.124062 2.554871 -2.56478
H  2.412052 4.037728 -0.745096
H  -0.390905 3.796715 0.442856
H  2.930259 5.323697 2.662906
H  -1.278699 6.086489 0.193337
H  2.03053 7.619304 2.428566
H  -0.070558 8.004851 1.182392
totalener: -2050.66177743 hartree
nucrepener: 2674.39705006 hartree
electener: -4725.05882749 hartree
oneelecener: -8124.11219643 hartree
twoeener: 3399.05336894 hartree
kineticenergy: 2044.53182639 hartree
xcener: -151.869755070391 hartree
chargesum: 0.0000000
charge: -0.038903 -0.044307 -0.257488 -0.382449 -0.292714 -0.003373 0.064673 0.045169 -0.101174 -0.252119 -0.237301 -0.200681 0.364565 0.046964 0.309852 0.001266 -0.254751 -0.148245 -0.170366 0.212553 -0.126041 -0.148668 0.207932 -0.154223 -0.175360 -0.118625 -0.107734 -0.127646 0.088446 0.079695 0.090723 0.091164 0.102074 0.099604 0.096584 0.071898 0.098315 0.118966 0.117181 0.121743 0.130560 0.133340 0.136074 0.127162 0.129600 0.127628 0.128438
qa: -0.0389 -0.0443 -0.2575 -0.3824 -0.2927 -0.0034 0.0647 0.0452 -0.1012 -0.2521 -0.2373 -0.2007 0.3646 0.0470 0.3099 0.0013 -0.2548 -0.1482 -0.1704 0.2126 -0.1260 -0.1487 0.2079 -0.1542 -0.1754 -0.1186 -0.1077 -0.1276 0.0884 0.0797 0.0907 0.0912 0.1021 0.0996 0.0966 0.0719 0.0983 0.1190 0.1172 0.1217 0.1306 0.1333 0.1361 0.1272 0.1296 0.1276 0.1284
va: 1.2886 1.2612 2.1357 2.1204 2.1109 3.1177 3.7672 3.8145 3.8792 3.9166 3.9084 3.9122 4.2394 4.2467 3.8320 3.6804 4.0213 4.0362 4.0384 3.9091 3.9800 3.9303 3.8312 3.9731 4.0286 3.9394 3.9381 3.9462 1.0486 1.0367 1.0011 1.0023 1.0198 1.0030 1.0043 1.0100 1.0285 1.0214 1.0330 1.0157 1.0013 1.0065 1.0021 1.0115 0.9995 0.9992 0.9997
dispcorr: -0.022602751 hartree
energy: -2050.684380179083
dipole: 19.78556 -20.52593 -0.74037 3.32870 -2.76383 0.56487 5.45587 -5.70112 -0.24524
magnitude: 0.96301 au
magnitude: 2.44777 debye
