program: Orca
programVersion: 5.0.2
elementType: Cl Cl O O O N C C C C C C C C C C C C C C C C C C C C C C H H H H H H H H H H H H H H H H H H H
charge: 0
multiplicity: 1
keywords: wb97x-d3
keywords: def2-TZVPP
keywords: def2/J RIJCOSX
keywords: DEFGRID2
keywords: scfconv7
keywords: smallprint printgap noloewdin
keywords: NOSOSCF
formula: C22H19Cl2NO3
InChI: InChI=1/C22H19Cl2NO3/c1-22(2)17(12-19(23)24)20(22)21(26)28-18(13-25)14-7-6-10-16(11-14)27-15-8-4-3-5-9-15/h3-12,17-18,20H,1-2H3
47 atoms
Cl -3.526437 -2.261222 2.489797
Cl -5.164232 -1.041212 0.451789
O  1.719546 -1.658278 -1.332555
O  1.450912 -2.450986 0.743639
O  1.915954 3.539697 -1.190026
N  4.380943 -1.040956 -3.196207
C  -0.995367 -3.921931 -0.577462
C  -1.459633 -2.716371 0.185609
C  -0.348096 -2.574975 -0.833066
C  -0.259513 -5.001105 0.178818
C  -1.853508 -4.462985 -1.69606
C  -2.752903 -2.068037 -0.077619
C  1.009202 -2.244003 -0.353178
C  -3.6847 -1.826244 0.836258
C  3.009966 -1.168476 -0.975911
C  2.906178 0.178597 -0.305094
C  3.76604 -1.098926 -2.228012
C  2.46375 1.274036 -1.03437
C  3.184038 0.302426 1.048027
C  2.309477 2.500677 -0.408071
C  3.032271 1.535966 1.662695
C  2.59808 2.63831 0.946315
C  1.176097 4.555545 -0.650749
C  1.583745 5.856027 -0.902337
C  0.020857 4.303203 0.078305
C  0.823977 6.913175 -0.423667
C  -0.7228 5.368676 0.56006
C  -0.326447 6.675446 0.312654
H  -1.126467 -2.682644 1.21692
H  -0.608468 -2.113436 -1.779066
H  0.434346 -5.528288 -0.478292
H  -0.975718 -5.732197 0.556606
H  0.303094 -4.619665 1.02651
H  -1.251174 -5.062374 -2.379833
H  -2.333247 -3.681975 -2.284727
H  -2.640835 -5.102869 -1.294874
H  -2.974472 -1.751848 -1.089575
H  3.521118 -1.874998 -0.314842
H  2.244352 1.190606 -2.092183
H  3.503419 -0.557804 1.620295
H  3.253632 1.642801 2.715989
H  2.489543 3.596085 1.438036
H  2.484845 6.03214 -1.474825
H  -0.298162 3.285286 0.263188
H  1.140688 7.92831 -0.622825
H  -1.623941 5.173327 1.1260
H  -0.913853 7.502405 0.687598
totalener: -2050.66121355 hartree
nucrepener: 2709.42841860 hartree
electener: -4760.08963216 hartree
oneelecener: -8194.10047098 hartree
twoeener: 3434.01083883 hartree
kineticenergy: 2044.53714699 hartree
xcener: -151.870558737298 hartree
chargesum: 0.0000000
charge: -0.038925 -0.042756 -0.261700 -0.381807 -0.294355 -0.001136 0.074665 0.033504 -0.105582 -0.250493 -0.232640 -0.198028 0.357867 0.043235 0.330384 0.002789 -0.263439 -0.199199 -0.119792 0.196112 -0.114438 -0.146345 0.220030 -0.193882 -0.154834 -0.098598 -0.118399 -0.136017 0.092035 0.081345 0.089390 0.089537 0.101873 0.095866 0.071933 0.099105 0.102516 0.119254 0.121487 0.116013 0.130009 0.135579 0.128800 0.134455 0.127308 0.129501 0.127774
qa: -0.0389 -0.0428 -0.2617 -0.3818 -0.2944 -0.0011 0.0747 0.0335 -0.1056 -0.2505 -0.2326 -0.1980 0.3579 0.0432 0.3304 0.0028 -0.2634 -0.1992 -0.1198 0.1961 -0.1144 -0.1463 0.2200 -0.1939 -0.1548 -0.0986 -0.1184 -0.1360 0.0920 0.0813 0.0894 0.0895 0.1019 0.0959 0.0719 0.0991 0.1025 0.1193 0.1215 0.1160 0.1300 0.1356 0.1288 0.1345 0.1273 0.1295 0.1278
va: 1.2884 1.2632 2.1388 2.1210 2.1091 3.1175 3.7541 3.8139 3.8936 3.9144 3.9077 3.9008 4.2279 4.2458 3.8221 3.6760 4.0248 4.0894 3.9846 3.9064 3.9733 3.9355 3.8172 4.0335 3.9516 3.9360 3.9471 3.9535 1.0455 1.0375 1.0019 1.0021 1.0207 1.0045 1.0092 1.0035 1.0255 1.0182 1.0289 1.0203 1.0009 1.0032 1.0123 1.0026 0.9988 0.9995 0.9998
dispcorr: -0.022904302 hartree
energy: -2050.684117854920
dipole: 15.18573 -15.99571 -0.80999 0.84799 -0.71416 0.13383 -5.93273 6.71890 0.78617
magnitude: 1.13668 au
magnitude: 2.88922 debye
