program: Orca
programVersion: 5.0.2
elementType: Cl Cl O O O N C C C C C C C C C C C C C C C C C C C C C C H H H H H H H H H H H H H H H H H H H
charge: 0
multiplicity: 1
keywords: wb97x-d3
keywords: def2-TZVPP
keywords: def2/J RIJCOSX
keywords: DEFGRID2
keywords: scfconv7
keywords: smallprint printgap noloewdin
keywords: NOSOSCF
formula: C22H19Cl2NO3
InChI: InChI=1/C22H19Cl2NO3/c1-22(2)17(12-19(23)24)20(22)21(26)28-18(13-25)14-7-6-10-16(11-14)27-15-8-4-3-5-9-15/h3-12,17-18,20H,1-2H3
47 atoms
Cl -1.121076 0.026364 -0.968568
Cl -3.756715 -0.213346 -2.128931
O  1.843983 -2.438852 -0.405725
O  0.964019 -2.333791 1.652534
O  1.351967 2.650784 1.61909
N  5.014467 -2.379407 -1.382942
C  -1.337677 -4.097382 0.403883
C  -1.694238 -2.650964 0.395632
C  -0.366179 -3.093121 -0.186673
C  -1.046753 -4.770094 1.722601
C  -1.99461 -5.00951 -0.605305
C  -2.718685 -2.068963 -0.497929
C  0.851182 -2.604376 0.487849
C  -2.556828 -0.905252 -1.114765
C  2.933798 -1.612612 -0.003352
C  2.578911 -0.169777 -0.269862
C  4.090476 -2.052258 -0.784846
C  2.159092 0.628901 0.781151
C  2.559352 0.316271 -1.573098
C  1.721241 1.926002 0.533086
C  2.126561 1.608392 -1.806559
C  1.704409 2.421651 -0.76409
C  0.557796 3.755567 1.463282
C  1.05259 4.981435 1.877786
C  -0.728818 3.643347 0.952716
C  0.247255 6.107624 1.786526
C  -1.520012 4.777343 0.858996
C  -1.037272 6.01097 1.274049
H  -1.600567 -2.15005 1.356181
H  -0.298783 -3.102528 -1.268117
H  -0.353567 -5.601418 1.585825
H  -1.969854 -5.176325 2.139297
H  -0.617921 -4.093772 2.457548
H  -1.362388 -5.874913 -0.807216
H  -2.186525 -4.513246 -1.557167
H  -2.948414 -5.3795 -0.224221
H  -3.657779 -2.591013 -0.639265
H  3.166589 -1.761692 1.055028
H  2.150703 0.252223 1.795859
H  2.882654 -0.305156 -2.398141
H  2.115182 1.997086 -2.815857
H  1.373237 3.431028 -0.96798
H  2.057414 5.046505 2.273827
H  -1.109042 2.679888 0.636706
H  0.631286 7.064888 2.113141
H  -2.524186 4.693283 0.465281
H  -1.66176 6.891029 1.201946
totalener: -2050.65909014 hartree
nucrepener: 2883.52968140 hartree
electener: -4934.18877153 hartree
oneelecener: -8542.49197336 hartree
twoeener: 3608.30320182 hartree
kineticenergy: 2044.53542710 hartree
xcener: -151.871936420526 hartree
chargesum: -0.0000000
charge: -0.038976 -0.041543 -0.253653 -0.379775 -0.290957 -0.004180 0.126661 -0.033168 -0.121719 -0.248379 -0.269717 -0.257646 0.336511 0.118271 0.328484 -0.012221 -0.260365 -0.151644 -0.164289 0.214192 -0.119200 -0.156544 0.201911 -0.169448 -0.129739 -0.113169 -0.138958 -0.118908 0.113476 0.104155 0.090292 0.084799 0.101911 0.098133 0.085823 0.094434 0.121710 0.120733 0.119866 0.117662 0.128989 0.130850 0.126399 0.125677 0.127119 0.128658 0.127478
qa: -0.0390 -0.0415 -0.2537 -0.3798 -0.2910 -0.0042 0.1267 -0.0332 -0.1217 -0.2484 -0.2697 -0.2576 0.3365 0.1183 0.3285 -0.0122 -0.2604 -0.1516 -0.1643 0.2142 -0.1192 -0.1565 0.2019 -0.1694 -0.1297 -0.1132 -0.1390 -0.1189 0.1135 0.1042 0.0903 0.0848 0.1019 0.0981 0.0858 0.0944 0.1217 0.1207 0.1199 0.1177 0.1290 0.1309 0.1264 0.1257 0.1271 0.1287 0.1275
va: 1.3258 1.2655 2.1216 2.1138 2.1103 3.1161 3.7226 3.8510 3.8494 3.8978 3.9117 3.9288 4.2187 4.1767 3.8155 3.6899 4.0260 3.9992 4.0230 3.8769 3.9663 3.9079 3.8187 4.0212 3.9467 3.9393 3.9744 3.9368 1.0266 1.0270 1.0020 1.0026 1.0199 1.0064 1.0009 1.0009 1.0151 1.0222 1.0327 1.0181 1.0024 1.0091 1.0116 1.0224 0.9993 0.9999 0.9996
dispcorr: -0.027201696 hartree
energy: -2050.686291832533
dipole: -0.69858 -1.06958 -1.76817 -7.88361 8.22067 0.33706 10.84328 -10.70489 0.13839
magnitude: 1.80532 au
magnitude: 4.58875 debye
