program: Orca
programVersion: 5.0.2
elementType: Cl Cl O O O N C C C C C C C C C C C C C C C C C C C C C C H H H H H H H H H H H H H H H H H H H
charge: 0
multiplicity: 1
keywords: wb97x-d3
keywords: def2-TZVPP
keywords: def2/J RIJCOSX
keywords: DEFGRID2
keywords: scfconv7
keywords: smallprint printgap noloewdin
keywords: NOSOSCF
formula: C22H19Cl2NO3
InChI: InChI=1/C22H19Cl2NO3/c1-22(2)17(12-19(23)24)20(22)21(26)28-18(13-25)14-7-6-10-16(11-14)27-15-8-4-3-5-9-15/h3-12,17-18,20H,1-2H3
47 atoms
Cl -1.492057 -0.549696 -1.476165
Cl -3.998365 -1.341542 -2.675846
O  1.707716 -2.350922 -0.342392
O  0.711695 -2.160521 1.65181
O  0.832625 2.765134 1.772057
N  4.795167 -1.792351 -1.394194
C  -1.239331 -4.371111 0.567314
C  -1.797038 -3.013361 0.312049
C  -0.381613 -3.330433 -0.127528
C  -0.953992 -4.784953 1.989854
C  -1.688557 -5.513507 -0.313168
C  -2.828771 -2.73791 -0.710944
C  0.703399 -2.575485 0.525369
C  -2.779882 -1.682994 -1.514885
C  2.656501 -1.361228 0.041957
C  2.08707 0.015746 -0.200873
C  3.847035 -1.611453 -0.771901
C  1.758913 0.819564 0.876696
C  1.81863 0.435359 -1.499887
C  1.154911 2.053708 0.661214
C  1.211549 1.661246 -1.701657
C  0.870235 2.475646 -0.630464
C  0.633345 4.115936 1.680967
C  1.649013 4.961445 1.254669
C  -0.592889 4.624849 2.076191
C  1.425087 6.328417 1.223457
C  -0.801417 5.996238 2.04935
C  0.201633 6.850864 1.619099
H  -1.846823 -2.3667 1.184947
H  -0.237368 -3.487731 -1.189886
H  -0.144748 -5.516028 2.023638
H  -1.84036 -5.255174 2.418937
H  -0.677482 -3.949497 2.627361
H  -2.611377 -5.953024 0.070335
H  -0.93338 -6.300136 -0.333871
H  -1.870525 -5.204211 -1.342795
H  -3.682651 -3.40022 -0.79249
H  2.938316 -1.475793 1.093068
H  1.946001 0.49118 1.890982
H  2.077984 -0.188687 -2.345355
H  0.991323 1.993204 -2.707303
H  0.385364 3.426063 -0.808658
H  2.606332 4.554227 0.955336
H  -1.370217 3.949553 2.408625
H  2.215768 6.988951 0.893387
H  -1.756751 6.395374 2.36283
H  0.034431 7.919057 1.596529
totalener: -2050.65870940 hartree
nucrepener: 2828.83643725 hartree
electener: -4879.49514665 hartree
oneelecener: -8433.29826588 hartree
twoeener: 3553.80311923 hartree
kineticenergy: 2044.55143076 hartree
xcener: -151.874470719075 hartree
chargesum: 0.0000000
charge: -0.029450 -0.042706 -0.255338 -0.381009 -0.292752 -0.003102 0.129366 -0.028817 -0.138489 -0.250778 -0.269181 -0.256582 0.347884 0.108379 0.336128 0.039112 -0.261417 -0.157462 -0.229704 0.217658 -0.141441 -0.126332 0.208949 -0.152557 -0.179157 -0.118710 -0.105387 -0.129090 0.113268 0.105652 0.088999 0.084733 0.102840 0.094284 0.097093 0.086840 0.119702 0.117621 0.115283 0.120870 0.133290 0.134249 0.135325 0.127263 0.129452 0.127175 0.128045
qa: -0.0294 -0.0427 -0.2553 -0.3810 -0.2928 -0.0031 0.1294 -0.0288 -0.1385 -0.2508 -0.2692 -0.2566 0.3479 0.1084 0.3361 0.0391 -0.2614 -0.1575 -0.2297 0.2177 -0.1414 -0.1263 0.2089 -0.1526 -0.1792 -0.1187 -0.1054 -0.1291 0.1133 0.1057 0.0890 0.0847 0.1028 0.0943 0.0971 0.0868 0.1197 0.1176 0.1153 0.1209 0.1333 0.1342 0.1353 0.1273 0.1295 0.1272 0.1280
va: 1.3269 1.2641 2.1307 2.1160 2.1111 3.1198 3.7153 3.8505 3.8739 3.8989 3.9129 3.9242 4.2071 4.1999 3.8185 3.6028 4.0251 4.0529 4.0036 3.9032 3.9168 3.9056 3.8313 3.9675 4.0309 3.9417 3.9371 3.9475 1.0249 1.0259 1.0022 1.0023 1.0207 1.0008 1.0064 1.0009 1.0165 1.0201 1.0325 1.0215 1.0015 1.0050 1.0025 1.0119 0.9995 0.9992 0.9998
dispcorr: -0.026105894 hartree
energy: -2050.684815295843
dipole: 3.74566 -5.24242 -1.49676 -3.86775 4.10891 0.24116 15.66846 -15.31311 0.35535
magnitude: 1.55715 au
magnitude: 3.95797 debye
