program: Orca
programVersion: 5.0.2
elementType: Cl Cl O O O N C C C C C C C C C C C C C C C C C C C C C C H H H H H H H H H H H H H H H H H H H
charge: 0
multiplicity: 1
keywords: wb97x-d3
keywords: def2-TZVPP
keywords: def2/J RIJCOSX
keywords: DEFGRID2
keywords: scfconv7
keywords: smallprint printgap noloewdin
keywords: NOSOSCF
formula: C22H19Cl2NO3
InChI: InChI=1/C22H19Cl2NO3/c1-22(2)17(12-19(23)24)20(22)21(26)28-18(13-25)14-7-6-10-16(11-14)27-15-8-4-3-5-9-15/h3-12,17-18,20H,1-2H3
47 atoms
Cl -1.039189 0.420379 1.992762
Cl -3.866234 0.868071 1.568385
O  1.31363 -1.864888 -0.955618
O  1.4200 -2.750805 1.098411
O  1.104511 3.059216 0.338369
N  3.544703 -1.15198 -3.295139
C  -1.51718 -3.72263 0.44395
C  -1.551593 -2.456699 1.225971
C  -0.68948 -2.539901 -0.023164
C  -0.851977 -4.927218 1.062963
C  -2.68871 -4.073597 -0.441875
C  -2.696262 -1.52363 1.229586
C  0.771231 -2.428902 0.142816
C  -2.558662 -0.244601 1.555419
C  2.665995 -1.456751 -0.852448
C  2.803468 -0.159458 -0.086832
C  3.139895 -1.292196 -2.229428
C  1.854963 0.84096 -0.264596
C  3.878514 0.025176 0.764834
C  1.995386 2.039987 0.419983
C  4.009471 1.230168 1.440743
C  3.07831 2.237361 1.272316
C  0.188133 3.101031 -0.67929
C  -1.157207 3.106043 -0.348339
C  0.595023 3.192917 -2.003558
C  -2.105431 3.201153 -1.355945
C  -0.362396 3.281267 -3.001523
C  -1.713372 3.284777 -2.683106
H  -0.974967 -2.472752 2.146759
H  -1.075229 -2.030359 -0.898268
H  -1.585517 -5.496513 1.636149
H  -0.037775 -4.662576 1.732489
H  -0.452236 -5.586624 0.290969
H  -3.477418 -4.557055 0.137832
H  -2.379225 -4.769311 -1.222616
H  -3.121663 -3.20357 -0.936246
H  -3.684353 -1.877851 0.962398
H  3.275049 -2.231523 -0.37492
H  1.012986 0.68322 -0.925814
H  4.605084 -0.763811 0.909626
H  4.844628 1.383818 2.110666
H  3.174247 3.176693 1.800471
H  -1.456743 3.039963 0.688311
H  1.648766 3.196678 -2.252345
H  -3.155664 3.200692 -1.096279
H  -0.047394 3.352439 -4.033984
H  -2.455471 3.35681 -3.466639
totalener: -2050.65918568 hartree
nucrepener: 2951.57388820 hartree
electener: -5002.23307388 hartree
oneelecener: -8678.66992241 hartree
twoeener: 3676.43684854 hartree
kineticenergy: 2044.54451267 hartree
xcener: -151.874754931236 hartree
chargesum: -0.0000000
charge: -0.033182 -0.045529 -0.274109 -0.363071 -0.287478 -0.002685 0.116485 -0.052727 -0.087189 -0.245985 -0.271460 -0.200367 0.315489 0.079455 0.314031 0.081932 -0.254969 -0.236190 -0.172244 0.241551 -0.078107 -0.216277 0.253215 -0.210583 -0.174775 -0.094990 -0.107917 -0.139014 0.115213 0.093595 0.086853 0.101998 0.089781 0.099598 0.096560 0.078877 0.120656 0.125724 0.130780 0.105624 0.126312 0.128231 0.131886 0.135386 0.122456 0.130667 0.126493
qa: -0.0332 -0.0455 -0.2741 -0.3631 -0.2875 -0.0027 0.1165 -0.0527 -0.0872 -0.2460 -0.2715 -0.2004 0.3155 0.0795 0.3140 0.0819 -0.2550 -0.2362 -0.1722 0.2416 -0.0781 -0.2163 0.2532 -0.2106 -0.1748 -0.0950 -0.1079 -0.1390 0.1152 0.0936 0.0869 0.1020 0.0898 0.0996 0.0966 0.0789 0.1207 0.1257 0.1308 0.1056 0.1263 0.1282 0.1319 0.1354 0.1225 0.1307 0.1265
va: 1.3100 1.2632 2.1042 2.1390 2.1142 3.1234 3.7853 3.8713 3.8211 3.8944 3.9124 3.8871 4.2415 4.1990 3.8319 3.6751 4.0137 3.9367 4.0513 3.7958 3.9496 4.0506 3.8009 4.0177 3.9810 3.9419 3.9347 3.9737 1.0266 1.0289 1.0020 1.0208 1.0025 0.9991 1.0069 1.0032 1.0155 1.0217 1.0268 1.0126 0.9996 1.0129 1.0256 1.0039 1.0078 0.9989 1.0002
dispcorr: -0.028309626 hartree
energy: -2050.687495301451
dipole: 1.03131 -2.20671 -1.17540 -16.89973 16.32927 -0.57046 -8.57721 9.17153 0.59432
magnitude: 1.43534 au
magnitude: 3.64835 debye
