program: Orca
programVersion: 5.0.2
elementType: Cl Cl O O O N C C C C C C C C C C C C C C C C C C C C C C H H H H H H H H H H H H H H H H H H H
charge: 0
multiplicity: 1
keywords: wb97x-d3
keywords: def2-TZVPP
keywords: def2/J RIJCOSX
keywords: DEFGRID2
keywords: scfconv7
keywords: smallprint printgap noloewdin
keywords: NOSOSCF
formula: C22H19Cl2NO3
InChI: InChI=1/C22H19Cl2NO3/c1-22(2)17(12-19(23)24)20(22)21(26)28-18(13-25)14-7-6-10-16(11-14)27-15-8-4-3-5-9-15/h3-12,17-18,20H,1-2H3
47 atoms
Cl -3.686447 -2.635875 2.463004
Cl -5.350138 -1.405372 0.452325
O  1.619063 -1.630405 -1.219972
O  1.303045 -2.463627 0.835022
O  1.876251 3.572327 -1.24231
N  4.371747 -1.103316 -2.984777
C  -1.014737 -4.001985 -0.665613
C  -1.563321 -2.883414 0.170869
C  -0.439089 -2.605709 -0.802899
C  -0.238693 -5.091731 0.032576
C  -1.810692 -4.505327 -1.84567
C  -2.884007 -2.288244 -0.080324
C  0.89183 -2.246411 -0.271472
C  -3.839791 -2.13459 0.827851
C  2.897515 -1.138281 -0.828002
C  2.780994 0.231574 -0.207539
C  3.709367 -1.119394 -2.046694
C  2.380151 1.307293 -0.987882
C  3.017494 0.397888 1.14914
C  2.228988 2.558687 -0.41006
C  2.870629 1.655166 1.714695
C  2.481044 2.739486 0.946564
C  1.203899 4.657591 -0.751199
C  1.702722 5.916381 -1.046061
C  0.027615 4.513033 -0.026491
C  1.015239 7.04086 -0.61317
C  -0.64324 5.644368 0.409794
C  -0.154175 6.910543 0.119931
H  -1.257412 -2.910008 1.210796
H  -0.702073 -2.092233 -1.721162
H  0.488613 -5.542881 -0.644924
H  -0.923732 -5.878467 0.35218
H  0.29331 -4.739045 0.912341
H  -2.567523 -5.219262 -1.517277
H  -1.156093 -5.014732 -2.554121
H  -2.321467 -3.711202 -2.388826
H  -3.107499 -1.935593 -1.079709
H  3.373299 -1.824707 -0.121111
H  2.193372 1.190191 -2.048765
H  3.303743 -0.446972 1.760719
H  3.062762 1.796269 2.769711
H  2.379681 3.716047 1.40117
H  2.617829 6.008654 -1.616009
H  -0.362735 3.526963 0.191442
H  1.40286 8.023605 -0.846641
H  -1.559317 5.533232 0.974659
H  -0.68442 7.789512 0.460226
totalener: -2050.66157810 hartree
nucrepener: 2690.95077664 hartree
electener: -4741.61235474 hartree
oneelecener: -8157.14438425 hartree
twoeener: 3415.53202951 hartree
kineticenergy: 2044.53165104 hartree
xcener: -151.869657403923 hartree
chargesum: -0.0000000
charge: -0.038892 -0.043437 -0.261786 -0.379994 -0.293251 -0.001494 0.070129 0.037737 -0.105234 -0.250727 -0.232378 -0.197639 0.357047 0.043807 0.327443 0.002863 -0.261349 -0.200989 -0.121348 0.205273 -0.115779 -0.150767 0.222896 -0.190936 -0.161471 -0.099993 -0.116503 -0.135211 0.090805 0.080602 0.090022 0.090686 0.101502 0.098446 0.096843 0.071390 0.100927 0.118891 0.121297 0.117072 0.129977 0.134792 0.128657 0.134889 0.127769 0.129474 0.127940
qa: -0.0389 -0.0434 -0.2618 -0.3800 -0.2933 -0.0015 0.0701 0.0377 -0.1052 -0.2507 -0.2324 -0.1976 0.3570 0.0438 0.3274 0.0029 -0.2613 -0.2010 -0.1213 0.2053 -0.1158 -0.1508 0.2229 -0.1909 -0.1615 -0.1000 -0.1165 -0.1352 0.0908 0.0806 0.0900 0.0907 0.1015 0.0984 0.0968 0.0714 0.1009 0.1189 0.1213 0.1171 0.1300 0.1348 0.1287 0.1349 0.1278 0.1295 0.1279
va: 1.2884 1.2624 2.1372 2.1232 2.1117 3.1174 3.7641 3.8126 3.8854 3.9154 3.9073 3.9036 4.2385 4.2461 3.8203 3.6856 4.0261 4.0936 3.9823 3.9016 3.9748 3.9342 3.8157 4.0345 3.9586 3.9347 3.9440 3.9530 1.0467 1.0372 1.0019 1.0022 1.0200 1.0035 1.0043 1.0094 1.0265 1.0203 1.0288 1.0192 1.0012 1.0040 1.0122 1.0024 0.9988 0.9994 0.9998
dispcorr: -0.022724829 hartree
energy: -2050.684302929901
dipole: 16.50325 -17.29966 -0.79642 3.12832 -2.84863 0.27969 -7.02631 7.71368 0.68738
magnitude: 1.08857 au
magnitude: 2.76693 debye
