program: Orca
programVersion: 5.0.2
elementType: Cl Cl O O O N C C C C C C C C C C C C C C C C C C C C C C H H H H H H H H H H H H H H H H H H H
charge: 0
multiplicity: 1
keywords: wb97x-d3
keywords: def2-TZVPP
keywords: def2/J RIJCOSX
keywords: DEFGRID2
keywords: scfconv7
keywords: smallprint printgap noloewdin
keywords: NOSOSCF
formula: C22H19Cl2NO3
InChI: InChI=1/C22H19Cl2NO3/c1-22(2)17(12-19(23)24)20(22)21(26)28-18(13-25)14-7-6-10-16(11-14)27-15-8-4-3-5-9-15/h3-12,17-18,20H,1-2H3
47 atoms
Cl -1.978935 -0.772176 1.064553
Cl -4.774951 -1.360909 0.621388
O  1.35849 -1.978449 -0.82318
O  1.372144 -3.126379 1.10338
O  0.82006 3.337149 -1.041183
N  4.000789 -0.855628 -2.474028
C  -0.92062 -4.792527 -0.280102
C  -1.481083 -3.748306 0.621222
C  -0.456222 -3.353942 -0.423268
C  -0.010096 -5.843538 0.305052
C  -1.770415 -5.299792 -1.420898
C  -2.862853 -3.23355 0.509828
C  0.841979 -2.850654 0.060664
C  -3.167845 -1.957051 0.70599
C  2.460516 -1.184052 -0.391039
C  1.93903 0.118417 0.165347
C  3.316867 -1.001656 -1.563299
C  1.672108 1.191873 -0.672157
C  1.642718 0.19955 1.52072
C  1.096571 2.34353 -0.156744
C  1.057794 1.35188 2.022239
C  0.775377 2.425455 1.193412
C  0.957776 4.646874 -0.678635
C  2.022723 5.096621 0.09214
C  0.013946 5.539082 -1.165342
C  2.126135 6.448284 0.381695
C  0.137194 6.889366 -0.877429
C  1.187208 7.349931 -0.097426
H  -1.084309 -3.756922 1.633424
H  -0.836753 -2.83359 -1.294168
H  0.56333 -5.480818 1.154217
H  0.692971 -6.207135 -0.445914
H  -0.603298 -6.695634 0.641132
H  -2.423706 -6.107234 -1.084621
H  -1.140887 -5.696138 -2.218575
H  -2.398861 -4.521617 -1.854941
H  -3.671033 -3.921242 0.291184
H  3.041394 -1.713495 0.36977
H  1.907251 1.150882 -1.728873
H  1.851247 -0.634725 2.176722
H  0.812811 1.415256 3.073891
H  0.311287 3.316588 1.595297
H  2.769764 4.40408 0.458065
H  -0.804069 5.171962 -1.770923
H  2.955873 6.79737 0.981903
H  -0.598701 7.583256 -1.261526
H  1.276745 8.403124 0.131082
totalener: -2050.65955043 hartree
nucrepener: 2789.26817007 hartree
electener: -4839.92772050 hartree
oneelecener: -8354.05108773 hartree
twoeener: 3514.12336723 hartree
kineticenergy: 2044.53969634 hartree
xcener: -151.872233145873 hartree
chargesum: 0.0000000
charge: -0.035393 -0.040417 -0.253733 -0.385206 -0.295198 -0.003547 0.122647 -0.041995 -0.123161 -0.248444 -0.269635 -0.241189 0.347844 0.102093 0.332619 0.024573 -0.261618 -0.194575 -0.175954 0.208273 -0.121258 -0.150897 0.246927 -0.165035 -0.209541 -0.116283 -0.091424 -0.143678 0.112272 0.102815 0.101692 0.090121 0.085820 0.094434 0.097628 0.086428 0.119748 0.125672 0.122164 0.132093 0.133188 0.136905 0.134391 0.127284 0.128216 0.126135 0.126200
qa: -0.0354 -0.0404 -0.2537 -0.3852 -0.2952 -0.0035 0.1226 -0.0420 -0.1232 -0.2484 -0.2696 -0.2412 0.3478 0.1021 0.3326 0.0246 -0.2616 -0.1946 -0.1760 0.2083 -0.1213 -0.1509 0.2469 -0.1650 -0.2095 -0.1163 -0.0914 -0.1437 0.1123 0.1028 0.1017 0.0901 0.0858 0.0944 0.0976 0.0864 0.1197 0.1257 0.1222 0.1321 0.1332 0.1369 0.1344 0.1273 0.1282 0.1261 0.1262
va: 1.3163 1.2663 2.1140 2.1105 2.1114 3.1129 3.7216 3.8632 3.8476 3.8974 3.9145 3.9090 4.2080 4.2016 3.7868 3.6915 4.0271 4.1150 3.9527 3.9066 3.9215 3.9474 3.8004 3.9368 4.0371 3.9459 3.9377 3.9611 1.0261 1.0274 1.0198 1.0024 1.0024 1.0005 1.0065 1.0011 1.0161 1.0235 1.0316 1.0200 1.0006 1.0019 1.0032 1.0134 0.9997 0.9988 1.0002
dispcorr: -0.025305221 hartree
energy: -2050.684855651965
dipole: 11.48537 -12.59071 -1.10535 -5.87540 5.67694 -0.19846 -1.93156 2.85089 0.91933
magnitude: 1.45132 au
magnitude: 3.68897 debye
