program: Orca
programVersion: 5.0.2
elementType: Cl Cl O O O N C C C C C C C C C C C C C C C C C C C C C C H H H H H H H H H H H H H H H H H H H
charge: 0
multiplicity: 1
keywords: wb97x-d3
keywords: def2-TZVPP
keywords: def2/J RIJCOSX
keywords: DEFGRID2
keywords: scfconv7
keywords: smallprint printgap noloewdin
keywords: NOSOSCF
formula: C22H19Cl2NO3
InChI: InChI=1/C22H19Cl2NO3/c1-22(2)17(12-19(23)24)20(22)21(26)28-18(13-25)14-7-6-10-16(11-14)27-15-8-4-3-5-9-15/h3-12,17-18,20H,1-2H3
47 atoms
Cl -4.535543 -0.799509 -1.274269
Cl -4.339567 -2.65022 -3.478856
O  1.612141 -1.731228 0.252408
O  -0.006209 -0.614882 1.321463
O  1.952916 4.092159 0.316837
N  4.89885 -1.922254 0.492147
C  -1.59337 -3.287197 0.878235
C  -2.001822 -2.286714 -0.1622
C  -0.531298 -2.582802 0.05675
C  -1.81845 -2.926429 2.326389
C  -1.766321 -4.763006 0.607291
C  -2.622618 -2.685224 -1.432479
C  0.335455 -1.529023 0.623277
C  -3.689125 -2.116442 -1.98095
C  2.562551 -0.770105 0.697854
C  2.512478 0.498056 -0.11942
C  3.865777 -1.427394 0.575126
C  2.242856 1.699892 0.516309
C  2.720962 0.450739 -1.491117
C  2.17947 2.870711 -0.230003
C  2.65785 1.624864 -2.223482
C  2.385899 2.832412 -1.603144
C  1.330645 4.201707 1.531087
C  1.955334 4.957442 2.510481
C  0.090142 3.62214 1.764691
C  1.328061 5.140085 3.734274
C  -0.519502 3.802074 2.995915
C  0.094104 4.559581 3.983859
H  -2.329276 -1.33359 0.23707
H  -0.04622 -3.200617 -0.690564
H  -1.768976 -1.856969 2.512167
H  -1.081486 -3.414813 2.966516
H  -2.805388 -3.27338 2.636369
H  -2.795197 -5.068514 0.803441
H  -1.115247 -5.344954 1.261014
H  -1.52871 -5.044553 -0.417844
H  -2.181145 -3.508173 -1.981001
H  2.403269 -0.535127 1.755311
H  2.073367 1.716441 1.585105
H  2.937544 -0.488209 -1.984187
H  2.819759 1.601937 -3.292638
H  2.33515 3.750142 -2.173904
H  2.920488 5.402719 2.307685
H  -0.393486 3.03238 0.996476
H  1.813381 5.734034 4.497308
H  -1.483676 3.347545 3.18046
H  -0.389089 4.698284 4.941423
totalener: -2050.66143407 hartree
nucrepener: 2737.69479611 hartree
electener: -4788.35623018 hartree
oneelecener: -8250.66813149 hartree
twoeener: 3462.31190132 hartree
kineticenergy: 2044.53271752 hartree
xcener: -151.870641045653 hartree
chargesum: -0.0000000
charge: -0.040192 -0.042704 -0.260566 -0.380027 -0.294832 -0.001334 0.065011 0.044531 -0.089982 -0.248357 -0.238534 -0.201426 0.351728 0.048172 0.308844 0.005434 -0.251543 -0.123046 -0.197872 0.235766 -0.086917 -0.198568 0.238616 -0.199782 -0.167533 -0.097348 -0.106073 -0.139488 0.087168 0.080030 0.101090 0.088848 0.089817 0.099753 0.095391 0.072571 0.098501 0.115635 0.115648 0.122893 0.128586 0.128411 0.127155 0.134042 0.127125 0.128727 0.126628
qa: -0.0402 -0.0427 -0.2606 -0.3800 -0.2948 -0.0013 0.0650 0.0445 -0.0900 -0.2484 -0.2385 -0.2014 0.3517 0.0482 0.3088 0.0054 -0.2515 -0.1230 -0.1979 0.2358 -0.0869 -0.1986 0.2386 -0.1998 -0.1675 -0.0973 -0.1061 -0.1395 0.0872 0.0800 0.1011 0.0888 0.0898 0.0998 0.0954 0.0726 0.0985 0.1156 0.1156 0.1229 0.1286 0.1284 0.1272 0.1340 0.1271 0.1287 0.1266
va: 1.2871 1.2629 2.1381 2.1226 2.1193 3.1189 3.7585 3.8206 3.8727 3.9151 3.9101 3.9182 4.2324 4.2490 3.8533 3.6690 4.0123 3.9099 4.0414 3.8769 3.9457 4.0321 3.8026 4.0447 3.9681 3.9322 3.9401 3.9555 1.0478 1.0369 1.0217 1.0020 1.0017 1.0028 1.0043 1.0100 1.0293 1.0209 1.0192 1.0165 0.9992 1.0122 1.0125 1.0057 0.9989 0.9994 1.0001
dispcorr: -0.023332729 hartree
energy: -2050.684766794479
dipole: 13.20128 -14.17981 -0.97853 0.45020 -0.56246 -0.11227 22.51438 -22.10292 0.41146
magnitude: 1.06743 au
magnitude: 2.71320 debye
