program: Orca
programVersion: 5.0.2
elementType: Cl Cl O O O N C C C C C C C C C C C C C C C C C C C C C C H H H H H H H H H H H H H H H H H H H
charge: 0
multiplicity: 1
keywords: wb97x-d3
keywords: def2-TZVPP
keywords: def2/J RIJCOSX
keywords: DEFGRID2
keywords: scfconv7
keywords: smallprint printgap noloewdin
keywords: NOSOSCF
formula: C22H19Cl2NO3
InChI: InChI=1/C22H19Cl2NO3/c1-22(2)17(12-19(23)24)20(22)21(26)28-18(13-25)14-7-6-10-16(11-14)27-15-8-4-3-5-9-15/h3-12,17-18,20H,1-2H3
47 atoms
Cl -2.678971 0.659137 -0.16164
Cl -5.065529 -0.813268 -0.845814
O  1.316044 -1.720138 -0.241081
O  1.508453 -3.59909 -1.429742
O  1.690557 3.133351 1.242826
N  2.618264 -0.657517 -3.187205
C  -0.942124 -3.345832 1.175508
C  -1.427544 -2.170574 0.378424
C  -0.522562 -3.200179 -0.272236
C  0.038049 -3.080759 2.293265
C  -1.871693 -4.497017 1.476573
C  -2.816273 -2.032764 -0.077925
C  0.855854 -2.894093 -0.714691
C  -3.428544 -0.87977 -0.321404
C  2.608436 -1.317078 -0.654398
C  3.007997 -0.106829 0.152507
C  2.600451 -0.974316 -2.08335
C  2.107708 0.940995 0.313747
C  4.283509 -0.03392 0.686187
C  2.503461 2.073612 1.010435
C  4.664177 1.102768 1.387518
C  3.785363 2.155664 1.548776
C  0.587896 3.355521 0.461545
C  0.688941 3.47349 -0.918494
C  -0.630357 3.524214 1.100008
C  -0.448558 3.753319 -1.659052
C  -1.758477 3.820304 0.348408
C  -1.673922 3.928233 -1.03141
H  -0.942456 -1.234682 0.625807
H  -0.994854 -3.904467 -0.947849
H  0.707913 -3.931473 2.430666
H  -0.504315 -2.935446 3.228854
H  0.645636 -2.193895 2.129578
H  -2.503002 -4.266894 2.336243
H  -1.295719 -5.391969 1.71579
H  -2.524848 -4.752443 0.64278
H  -3.398724 -2.931686 -0.237773
H  3.333472 -2.124149 -0.509114
H  1.110921 0.87339 -0.103843
H  4.980152 -0.851844 0.554628
H  5.658828 1.169073 1.80701
H  4.077319 3.046011 2.089654
H  1.644677 3.348824 -1.411909
H  -0.688351 3.433861 2.176598
H  -0.371908 3.839617 -2.734575
H  -2.708956 3.958759 0.846457
H  -2.55705 4.148816 -1.615099
totalener: -2050.65795883 hartree
nucrepener: 2884.31736357 hartree
electener: -4934.97532240 hartree
oneelecener: -8543.91118033 hartree
twoeener: 3608.93585792 hartree
kineticenergy: 2044.52871206 hartree
xcener: -151.871917009341 hartree
chargesum: 0.0000000
charge: -0.041991 -0.048283 -0.282286 -0.329978 -0.294310 -0.000464 0.067497 0.070077 -0.071928 -0.246528 -0.264159 -0.214925 0.337067 0.062999 0.291715 0.040490 -0.245662 -0.191845 -0.171557 0.251504 -0.085231 -0.208050 0.252890 -0.177776 -0.174622 -0.091011 -0.172135 -0.125312 0.070718 0.087228 0.094961 0.090342 0.088904 0.100172 0.096478 0.076609 0.096486 0.112387 0.116252 0.112191 0.128031 0.129500 0.139200 0.125259 0.133128 0.135310 0.130655
qa: -0.0420 -0.0483 -0.2823 -0.3300 -0.2943 -0.0005 0.0675 0.0701 -0.0719 -0.2465 -0.2642 -0.2149 0.3371 0.0630 0.2917 0.0405 -0.2457 -0.1918 -0.1716 0.2515 -0.0852 -0.2080 0.2529 -0.1778 -0.1746 -0.0910 -0.1721 -0.1253 0.0707 0.0872 0.0950 0.0903 0.0889 0.1002 0.0965 0.0766 0.0965 0.1124 0.1163 0.1122 0.1280 0.1295 0.1392 0.1253 0.1331 0.1353 0.1307
va: 1.3061 1.2582 2.1299 2.1766 2.1236 3.1167 3.7723 3.7952 3.8393 3.9144 3.9200 3.9316 4.2717 4.2506 3.8848 3.7393 3.9738 3.9499 4.0096 3.8399 3.9669 4.0347 3.7705 3.9686 3.9848 3.9310 3.8905 3.8880 1.0323 1.0298 1.0014 1.0034 1.0142 1.0009 1.0034 1.0100 1.0329 1.0253 1.0323 1.0122 1.0000 1.0124 1.0018 1.0122 0.9979 1.0012 0.9997
dispcorr: -0.026466677 hartree
energy: -2050.684425509339
dipole: 14.47546 -14.71416 -0.23871 -9.23857 9.01798 -0.22059 14.23415 -12.33562 1.89853
magnitude: 1.92616 au
magnitude: 4.89590 debye
