program: Orca
programVersion: 5.0.2
elementType: Cl Cl O O O N C C C C C C C C C C C C C C C C C C C C C C H H H H H H H H H H H H H H H H H H H
charge: 0
multiplicity: 1
keywords: wb97x-d3
keywords: def2-TZVPP
keywords: def2/J RIJCOSX
keywords: DEFGRID2
keywords: scfconv7
keywords: smallprint printgap noloewdin
keywords: NOSOSCF
formula: C22H19Cl2NO3
InChI: InChI=1/C22H19Cl2NO3/c1-22(2)17(12-19(23)24)20(22)21(26)28-18(13-25)14-7-6-10-16(11-14)27-15-8-4-3-5-9-15/h3-12,17-18,20H,1-2H3
47 atoms
Cl -2.968336 -3.713072 3.222094
Cl -5.367803 -2.449175 2.243888
O  0.814169 -0.901077 -1.245635
O  1.084176 -2.253298 0.514139
O  1.35019 4.046842 0.571402
N  2.853397 0.396101 -3.494179
C  -1.429819 -3.5686 -0.956436
C  -1.773888 -3.004013 0.394648
C  -1.032244 -2.147262 -0.606815
C  -0.388344 -4.658185 -1.017556
C  -2.503342 -3.720595 -2.005643
C  -3.151589 -2.643384 0.752011
C  0.379095 -1.801421 -0.350763
C  -3.738116 -2.901409 1.914222
C  2.173287 -0.486058 -1.130926
C  2.352921 0.588933 -0.086808
C  2.535796 0.006894 -2.46148
C  1.75141 1.828369 -0.269511
C  3.0958 0.326385 1.055875
C  1.923661 2.814786 0.690804
C  3.238544 1.315439 2.018676
C  2.662213 2.5622 1.839628
C  1.327445 4.664318 -0.652305
C  2.432354 4.663031 -1.495598
C  0.169039 5.34253 -1.001311
C  2.361281 5.340169 -2.704084
C  0.11754 6.026822 -2.20803
C  1.20756 6.023235 -3.066752
H  -1.163464 -3.3834 1.20612
H  -1.601099 -1.37607 -1.114201
H  0.330258 -4.616205 -0.201696
H  0.163386 -4.612611 -1.958642
H  -0.876069 -5.63315 -0.9693
H  -3.075569 -4.634418 -1.835243
H  -2.052041 -3.792332 -2.996649
H  -3.203519 -2.886717 -2.027305
H  -3.748032 -2.122614 0.01212
H  2.825442 -1.336866 -0.91257
H  1.161188 2.027828 -1.157172
H  3.561215 -0.640724 1.193745
H  3.814527 1.117971 2.913101
H  2.78497 3.339786 2.583173
H  3.341878 4.144264 -1.218689
H  -0.682695 5.335981 -0.332789
H  3.220342 5.33663 -3.362554
H  -0.786073 6.557111 -2.479744
H  1.160809 6.550734 -4.010379
elementType: Cl O N C H
totalener: -2050.68683866 hartree
nucrepener: 2698.11322085 hartree
electener: -4748.80005951 hartree
oneelecener: -8171.86336994 hartree
twoeener: 3423.06331042 hartree
cpcmener: -0.03096940 hartree
kineticenergy: 2044.46573088 hartree
xcener: -151.861667729891 hartree
chargesum: -0.0000000
charge: -0.055410 -0.059946 -0.279983 -0.443453 -0.329941 -0.088945 0.083562 0.031267 -0.087621 -0.263050 -0.262782 -0.206317 0.402380 0.040987 0.420772 0.014113 -0.232620 -0.182735 -0.183626 0.215337 -0.122368 -0.218320 0.267153 -0.177339 -0.242006 -0.146867 -0.124386 -0.180688 0.078573 0.100132 0.094120 0.101222 0.099366 0.101860 0.099133 0.090473 0.130800 0.140813 0.146914 0.144945 0.158908 0.149044 0.155330 0.146439 0.159000 0.157949 0.157808
qa: -0.0554 -0.0599 -0.2800 -0.4435 -0.3299 -0.0889 0.0836 0.0313 -0.0876 -0.2631 -0.2628 -0.2063 0.4024 0.0410 0.4208 0.0141 -0.2326 -0.1827 -0.1836 0.2153 -0.1224 -0.2183 0.2672 -0.1773 -0.2420 -0.1469 -0.1244 -0.1807 0.0786 0.1001 0.0941 0.1012 0.0994 0.1019 0.0991 0.0905 0.1308 0.1408 0.1469 0.1449 0.1589 0.1490 0.1553 0.1464 0.1590 0.1579 0.1578
va: 1.2702 1.2447 2.1390 2.0726 2.0763 3.1088 3.7551 3.8591 3.8323 3.9094 3.9052 3.8971 4.2047 4.2107 3.7247 3.5829 4.0732 3.9549 3.9431 3.7900 3.9108 4.0105 3.7074 3.8922 4.0066 3.8955 3.8869 3.9027 1.0510 1.0318 1.0168 0.9995 1.0005 1.0011 1.0015 1.0057 1.0176 1.0158 1.0109 1.0095 0.9895 1.0039 0.9973 1.0075 0.9904 0.9891 0.9904
dispcorr: -0.023181235 hartree
energy: -2050.710019895562
dipole: 17.33797 -17.54494 -0.20696 7.70842 -8.05795 -0.34953 -22.60130 22.29956 -0.30173
magnitude: 0.50601 au
magnitude: 1.28618 debye
