program: Orca
programVersion: 5.0.2
elementType: Cl Cl O O O N C C C C C C C C C C C C C C C C C C C C C C H H H H H H H H H H H H H H H H H H H
charge: 0
multiplicity: 1
keywords: wb97x-d3
keywords: def2-TZVPP
keywords: def2/J RIJCOSX
keywords: DEFGRID2
keywords: scfconv7
keywords: smallprint printgap noloewdin
keywords: NOSOSCF
formula: C22H19Cl2NO3
InChI: InChI=1/C22H19Cl2NO3/c1-22(2)17(12-19(23)24)20(22)21(26)28-18(13-25)14-7-6-10-16(11-14)27-15-8-4-3-5-9-15/h3-12,17-18,20H,1-2H3
47 atoms
Cl -2.883283 -3.144761 3.362525
Cl -5.216837 -1.930282 2.181714
O  1.008736 -1.088112 -1.297981
O  1.237231 -2.374909 0.514812
O  1.28819 3.823996 0.554438
N  3.10388 0.200581 -3.502522
C  -1.3300 -3.714085 -0.785469
C  -1.663947 -2.95355 0.465329
C  -0.865357 -2.277397 -0.631068
C  -0.347954 -4.853001 -0.67425
C  -2.394817 -3.952593 -1.827959
C  -3.022145 -2.475376 0.750581
C  0.548472 -1.949427 -0.375651
C  -3.615193 -2.514911 1.937262
C  2.358273 -0.659113 -1.151059
C  2.493988 0.433175 -0.117614
C  2.758335 -0.18178 -2.476382
C  1.814343 1.632368 -0.297502
C  3.271116 0.222318 1.011791
C  1.944454 2.633471 0.653759
C  3.374892 1.226068 1.96443
C  2.72089 2.433661 1.788611
C  1.150977 4.444408 -0.658494
C  2.1692 4.464627 -1.604399
C  -0.040423 5.117793 -0.886813
C  1.976183 5.157805 -2.790471
C  -0.213413 5.81737 -2.072285
C  0.788989 5.835707 -3.031887
H  -1.080152 -3.2423 1.331746
H  -1.39027 -1.558906 -1.250623
H  0.220719 -4.964882 -1.599508
H  -0.889603 -5.785828 -0.507821
H  0.35838 -4.738276 0.145178
H  -3.024633 -4.797925 -1.544674
H  -1.933943 -4.190455 -2.788218
H  -3.042001 -3.090376 -1.983811
H  -3.594547 -2.050133 -0.065271
H  3.014222 -1.498375 -0.899861
H  1.19334 1.786154 -1.173033
H  3.791292 -0.716777 1.148589
H  3.97653 1.069233 2.849815
H  2.808372 3.22164 2.526126
H  3.106605 3.952696 -1.426179
H  -0.822622 5.098527 -0.1381
H  2.768355 5.17037 -3.528082
H  -1.142742 6.344469 -2.245771
H  0.648378 6.375673 -3.958901
elementType: Cl O N C H
totalener: -2050.68681877 hartree
nucrepener: 2712.83270971 hartree
electener: -4763.51952849 hartree
oneelecener: -8201.29468249 hartree
twoeener: 3437.77515400 hartree
cpcmener: -0.03074152 hartree
kineticenergy: 2044.47488703 hartree
xcener: -151.863730571095 hartree
chargesum: -0.0000000
charge: -0.054952 -0.059946 -0.283492 -0.442766 -0.327516 -0.088706 0.083528 0.033364 -0.083790 -0.263556 -0.263470 -0.207281 0.396540 0.043524 0.420865 0.022060 -0.230462 -0.206986 -0.189274 0.241777 -0.116736 -0.228429 0.290547 -0.194072 -0.254088 -0.143119 -0.117747 -0.187516 0.078750 0.098800 0.100991 0.098545 0.094338 0.102500 0.098903 0.090861 0.131282 0.139946 0.148003 0.145211 0.158900 0.148783 0.155044 0.145685 0.159520 0.157697 0.157938
qa: -0.0550 -0.0599 -0.2835 -0.4428 -0.3275 -0.0887 0.0835 0.0334 -0.0838 -0.2636 -0.2635 -0.2073 0.3965 0.0435 0.4209 0.0221 -0.2305 -0.2070 -0.1893 0.2418 -0.1167 -0.2284 0.2905 -0.1941 -0.2541 -0.1431 -0.1177 -0.1875 0.0788 0.0988 0.1010 0.0985 0.0943 0.1025 0.0989 0.0909 0.1313 0.1399 0.1480 0.1452 0.1589 0.1488 0.1550 0.1457 0.1595 0.1577 0.1579
va: 1.2705 1.2449 2.1368 2.0725 2.0836 3.1089 3.7483 3.8547 3.8385 3.9086 3.9071 3.9030 4.2000 4.2119 3.7279 3.5805 4.0724 3.9659 3.9517 3.7720 3.9072 4.0129 3.6912 3.9022 4.0105 3.8929 3.8833 3.9098 1.0509 1.0321 0.9992 1.0005 1.0174 1.0005 1.0017 1.0056 1.0179 1.0165 1.0114 1.0077 0.9894 1.0045 0.9980 1.0084 0.9902 0.9891 0.9906
dispcorr: -0.023116110 hartree
energy: -2050.709934884867
dipole: 16.16473 -16.47908 -0.31435 3.72481 -4.23340 -0.50859 -21.59394 21.34727 -0.24667
magnitude: 0.64679 au
magnitude: 1.64400 debye
