program: Orca
programVersion: 5.0.2
elementType: Cl Cl O O O N C C C C C C C C C C C C C C C C C C C C C C H H H H H H H H H H H H H H H H H H H
charge: 0
multiplicity: 1
keywords: wb97x-d3
keywords: def2-TZVPP
keywords: def2/J RIJCOSX
keywords: DEFGRID2
keywords: scfconv7
keywords: smallprint printgap noloewdin
keywords: NOSOSCF
formula: C22H19Cl2NO3
InChI: InChI=1/C22H19Cl2NO3/c1-22(2)17(12-19(23)24)20(22)21(26)28-18(13-25)14-7-6-10-16(11-14)27-15-8-4-3-5-9-15/h3-12,17-18,20H,1-2H3
47 atoms
Cl -2.87338 -2.628021 3.366259
Cl -5.1660 -1.545497 1.989604
O  1.09706 -1.17267 -1.30522
O  1.304889 -2.429137 0.531328
O  1.31154 3.721791 0.575759
N  3.190849 0.116685 -3.505644
C  -1.283015 -3.781661 -0.683569
C  -1.631203 -2.90742 0.484741
C  -0.783211 -2.35018 -0.643978
C  -0.340744 -4.933737 -0.437876
C  -2.320205 -4.084505 -1.737578
C  -2.977875 -2.359982 0.682725
C  0.627336 -2.021599 -0.376226
C  -3.579837 -2.204048 1.854799
C  2.445092 -0.740128 -1.152712
C  2.576022 0.355781 -0.122523
C  2.846306 -0.263873 -2.478419
C  1.87028 1.541616 -0.293852
C  3.376061 0.161509 0.993329
C  1.99528 2.546064 0.654492
C  3.478093 1.170003 1.941463
C  2.797035 2.363442 1.775211
C  1.074174 4.32199 -0.6317
C  2.031784 4.376169 -1.637652
C  -0.155196 4.945728 -0.789501
C  1.740666 5.055964 -2.811571
C  -0.426632 5.632818 -1.96395
C  0.515566 5.686682 -2.981594
H  -1.079268 -3.132296 1.390218
H  -1.278298 -1.676635 -1.33419
H  0.254649 -5.14422 -1.328527
H  -0.917924 -5.83158 -0.209012
H  0.340833 -4.76609 0.39307
H  -2.982419 -4.885534 -1.403558
H  -1.834602 -4.418616 -2.656067
H  -2.93796 -3.22459 -1.994051
H  -3.53294 -2.044465 -0.192573
H  3.101833 -1.577736 -0.89744
H  1.231903 1.679359 -1.159374
H  3.915444 -0.767688 1.123381
H  4.097981 1.027205 2.816567
H  2.880911 3.153948 2.510449
H  2.99738 3.901642 -1.514964
H  -0.889167 4.900122 0.005487
H  2.485432 5.095832 -3.596119
H  -1.384509 6.1227 -2.082597
H  0.29881 6.218059 -3.898868
elementType: Cl O N C H
totalener: -2050.68691536 hartree
nucrepener: 2724.01585412 hartree
electener: -4774.70276949 hartree
oneelecener: -8223.69631534 hartree
twoeener: 3448.99354585 hartree
cpcmener: -0.03074756 hartree
kineticenergy: 2044.47236835 hartree
xcener: -151.863482166001 hartree
chargesum: 0.0000000
charge: -0.055009 -0.059885 -0.284369 -0.443201 -0.325934 -0.088824 0.083057 0.031167 -0.077006 -0.264390 -0.265390 -0.204948 0.393994 0.044288 0.421089 0.022176 -0.230043 -0.214251 -0.193556 0.254466 -0.113515 -0.234492 0.295719 -0.199630 -0.255807 -0.140693 -0.116319 -0.188551 0.080004 0.098034 0.100396 0.098298 0.094388 0.102190 0.098955 0.091500 0.129268 0.139901 0.147892 0.145204 0.159003 0.148385 0.155328 0.145715 0.159632 0.157723 0.158040
qa: -0.0550 -0.0599 -0.2844 -0.4432 -0.3259 -0.0888 0.0831 0.0312 -0.0770 -0.2644 -0.2654 -0.2049 0.3940 0.0443 0.4211 0.0222 -0.2300 -0.2143 -0.1936 0.2545 -0.1135 -0.2345 0.2957 -0.1996 -0.2558 -0.1407 -0.1163 -0.1886 0.0800 0.0980 0.1004 0.0983 0.0944 0.1022 0.0990 0.0915 0.1293 0.1399 0.1479 0.1452 0.1590 0.1484 0.1553 0.1457 0.1596 0.1577 0.1580
va: 1.2706 1.2448 2.1354 2.0722 2.0865 3.1092 3.7468 3.8609 3.8323 3.9075 3.9091 3.9057 4.1978 4.2123 3.7289 3.5874 4.0726 3.9652 3.9565 3.7653 3.9054 4.0120 3.6852 3.9108 4.0123 3.8906 3.8813 3.9110 1.0494 1.0324 0.9994 1.0003 1.0180 1.0004 1.0014 1.0057 1.0194 1.0164 1.0123 1.0070 0.9893 1.0051 0.9978 1.0085 0.9901 0.9891 0.9906
dispcorr: -0.023082342 hartree
energy: -2050.709997706033
dipole: 15.68098 -16.03479 -0.35381 0.54946 -1.18882 -0.63936 -20.33832 20.11483 -0.22349
magnitude: 0.76414 au
magnitude: 1.94229 debye
