program: Orca
programVersion: 5.0.2
elementType: Cl Cl O O O N C C C C C C C C C C C C C C C C C C C C C C H H H H H H H H H H H H H H H H H H H
charge: 0
multiplicity: 1
keywords: wb97x-d3
keywords: def2-TZVPP
keywords: def2/J RIJCOSX
keywords: DEFGRID2
keywords: scfconv7
keywords: smallprint printgap noloewdin
keywords: NOSOSCF
formula: C22H19Cl2NO3
InChI: InChI=1/C22H19Cl2NO3/c1-22(2)17(12-19(23)24)20(22)21(26)28-18(13-25)14-7-6-10-16(11-14)27-15-8-4-3-5-9-15/h3-12,17-18,20H,1-2H3
47 atoms
Cl -4.948414 -2.418429 -1.799155
Cl -4.038244 -3.597959 -4.269845
O  1.258283 -1.533169 0.283792
O  -0.769291 -0.802078 0.882784
O  1.39173 4.391771 0.407442
N  4.26332 -1.285709 1.609341
C  -1.287711 -3.891702 0.10979
C  -2.011778 -2.928978 -0.792929
C  -0.539486 -2.734686 -0.524307
C  -1.628607 -3.861205 1.578364
C  -0.927297 -5.268169 -0.390981
C  -2.428251 -3.309459 -2.149383
C  -0.08478 -1.588036 0.283273
C  -3.638621 -3.128188 -2.66166
C  1.867635 -0.454636 0.978122
C  1.957855 0.791276 0.128211
C  3.208462 -0.933352 1.323002
C  1.620907 2.015554 0.683439
C  2.393812 0.707113 -1.190548
C  1.744233 3.16738 -0.085216
C  2.48738 1.861449 -1.949443
C  2.174334 3.097328 -1.400085
C  1.885676 4.802259 1.616463
C  3.156429 4.455782 2.059164
C  1.074565 5.635513 2.37497
C  3.604737 4.944643 3.278347
C  1.541276 6.123804 3.586418
C  2.803621 5.776325 4.048023
H  -2.668625 -2.238755 -0.275395
H  0.144899 -3.017689 -1.316746
H  -2.432134 -4.570942 1.782532
H  -1.964207 -2.884604 1.922624
H  -0.767859 -4.15585 2.181909
H  -0.113911 -5.684257 0.20606
H  -0.602085 -5.272958 -1.430569
H  -1.780627 -5.943323 -0.304041
H  -1.69103 -3.774388 -2.793433
H  1.347451 -0.237831 1.916711
H  1.266346 2.070468 1.706153
H  2.659259 -0.247632 -1.626574
H  2.821249 1.805214 -2.977001
H  2.261742 4.001301 -1.989422
H  3.799827 3.818159 1.465885
H  0.088008 5.900691 2.015644
H  4.594465 4.673537 3.622772
H  0.907005 6.773753 4.175442
H  3.16143 6.153191 4.996988
elementType: Cl O N C H
totalener: -2050.68645931 hartree
nucrepener: 2662.45939892 hartree
electener: -4713.14585823 hartree
oneelecener: -8100.21955959 hartree
twoeener: 3387.07370136 hartree
cpcmener: -0.03184912 hartree
kineticenergy: 2044.47123441 hartree
xcener: -151.861832918479 hartree
chargesum: 0.0000000
charge: -0.055150 -0.058874 -0.278863 -0.434883 -0.328386 -0.087621 0.086536 0.027484 -0.090642 -0.260330 -0.257034 -0.200065 0.382668 0.034348 0.398054 0.025617 -0.224616 -0.166051 -0.205786 0.220945 -0.139135 -0.196012 0.268199 -0.173508 -0.244217 -0.153477 -0.121602 -0.184747 0.081846 0.099907 0.099539 0.093012 0.101317 0.099506 0.089179 0.102090 0.132494 0.139324 0.148495 0.149430 0.159059 0.149388 0.153455 0.146253 0.158962 0.156601 0.157294
qa: -0.0552 -0.0589 -0.2789 -0.4349 -0.3284 -0.0876 0.0865 0.0275 -0.0906 -0.2603 -0.2570 -0.2001 0.3827 0.0343 0.3981 0.0256 -0.2246 -0.1661 -0.2058 0.2209 -0.1391 -0.1960 0.2682 -0.1735 -0.2442 -0.1535 -0.1216 -0.1847 0.0818 0.0999 0.0995 0.0930 0.1013 0.0995 0.0892 0.1021 0.1325 0.1393 0.1485 0.1494 0.1591 0.1494 0.1535 0.1463 0.1590 0.1566 0.1573
va: 1.2702 1.2462 2.1243 2.0821 2.0728 3.1108 3.7592 3.8616 3.8295 3.9086 3.9011 3.8832 4.2204 4.2099 3.7223 3.6053 4.0786 3.9685 3.9600 3.7763 3.9185 4.0046 3.7068 3.8809 3.9973 3.9024 3.8904 3.9028 1.0473 1.0314 1.0006 1.0160 0.9999 1.0021 1.0051 1.0015 1.0155 1.0227 1.0047 1.0099 0.9899 1.0034 0.9991 1.0081 0.9906 0.9893 0.9905
dispcorr: -0.022855865 hartree
energy: -2050.709315177887
dipole: 22.08943 -22.01066 0.07877 6.08877 -6.52828 -0.43950 21.47937 -21.61849 -0.13913
magnitude: 0.46768 au
magnitude: 1.18875 debye
