program: Orca
programVersion: 5.0.2
elementType: Cl Cl O O O N C C C C C C C C C C C C C C C C C C C C C C H H H H H H H H H H H H H H H H H H H
charge: 0
multiplicity: 1
keywords: wb97x-d3
keywords: def2-TZVPP
keywords: def2/J RIJCOSX
keywords: DEFGRID2
keywords: scfconv7
keywords: smallprint printgap noloewdin
keywords: NOSOSCF
formula: C22H19Cl2NO3
InChI: InChI=1/C22H19Cl2NO3/c1-22(2)17(12-19(23)24)20(22)21(26)28-18(13-25)14-7-6-10-16(11-14)27-15-8-4-3-5-9-15/h3-12,17-18,20H,1-2H3
47 atoms
Cl -4.8082 -2.515763 -0.479867
Cl -4.58681 -5.159853 -1.611803
O  1.525883 -1.329106 -1.134106
O  -0.244779 -0.209835 -0.365402
O  2.896629 3.820886 1.653643
N  1.10175 1.46825 -3.00988
C  -0.654014 -3.045726 1.037514
C  -1.704957 -2.769665 -0.000161
C  -0.244275 -2.609732 -0.358496
C  -0.550444 -2.092429 2.201591
C  -0.322605 -4.46992 1.410212
C  -2.468755 -3.852441 -0.631321
C  0.291288 -1.260006 -0.601672
C  -3.773229 -3.833597 -0.87303
C  2.243203 -0.114928 -1.269174
C  2.548047 0.537257 0.06563
C  1.571881 0.782124 -2.218116
C  2.529446 1.916475 0.213871
C  2.904406 -0.279551 1.133289
C  2.850072 2.476358 1.44578
C  3.219784 0.294992 2.354699
C  3.188901 1.669519 2.522581
C  2.092972 4.674193 0.943655
C  2.679626 5.827407 0.444521
C  0.732832 4.439977 0.782722
C  1.893755 6.759255 -0.21897
C  -0.037341 5.373736 0.105432
C  0.536008 6.534739 -0.396548
H  -2.240442 -1.837444 0.140293
H  0.203668 -3.388501 -0.965849
H  -1.191514 -2.439745 3.013766
H  -0.857112 -1.077134 1.959083
H  0.471567 -2.055486 2.583389
H  -0.289226 -5.142437 0.55404
H  -1.059102 -4.860916 2.114904
H  0.654014 -4.513424 1.895177
H  -1.932203 -4.745227 -0.9299
H  3.183215 -0.409779 -1.744634
H  2.270515 2.556933 -0.620404
H  2.93845 -1.355833 1.026352
H  3.490636 -0.33743 3.189862
H  3.431346 2.116717 3.478259
H  3.740459 5.996346 0.581658
H  0.273286 3.543564 1.180349
H  2.350981 7.661574 -0.604009
H  -1.096577 5.191753 -0.022698
H  -0.072946 7.26052 -0.919228
elementType: Cl O N C H
totalener: -2050.68460131 hartree
nucrepener: 2736.26742828 hartree
electener: -4786.95202959 hartree
oneelecener: -8248.62587300 hartree
twoeener: 3461.67384341 hartree
cpcmener: -0.03377771 hartree
kineticenergy: 2044.47264326 hartree
xcener: -151.867577466693 hartree
chargesum: 0.0000000
charge: -0.054383 -0.059712 -0.288327 -0.426828 -0.324625 -0.078006 0.088545 0.028824 -0.048385 -0.264506 -0.264486 -0.206371 0.361866 0.040504 0.505186 -0.019733 -0.255658 -0.187703 -0.310221 0.286455 -0.087883 -0.247421 0.278707 -0.243807 -0.193086 -0.121626 -0.138111 -0.181782 0.080803 0.100049 0.105476 0.098067 0.091959 0.091740 0.102898 0.098374 0.130199 0.146997 0.135403 0.148261 0.158480 0.146918 0.145872 0.157148 0.157358 0.158958 0.157616
qa: -0.0544 -0.0597 -0.2883 -0.4268 -0.3246 -0.0780 0.0885 0.0288 -0.0484 -0.2645 -0.2645 -0.2064 0.3619 0.0405 0.5052 -0.0197 -0.2557 -0.1877 -0.3102 0.2865 -0.0879 -0.2474 0.2787 -0.2438 -0.1931 -0.1216 -0.1381 -0.1818 0.0808 0.1000 0.1055 0.0981 0.0920 0.0917 0.1029 0.0984 0.1302 0.1470 0.1354 0.1483 0.1585 0.1469 0.1459 0.1571 0.1574 0.1590 0.1576
va: 1.2713 1.2452 2.1295 2.0774 2.0853 3.1060 3.7368 3.8946 3.8320 3.8954 3.9022 3.8968 4.1941 4.2123 3.8021 3.7112 4.1132 3.9116 3.9814 3.7845 3.8818 4.0250 3.6937 4.0138 3.9207 3.8831 3.8872 3.9061 1.0487 1.0320 1.0014 1.0154 1.0039 1.0055 1.0007 1.0021 1.0178 0.9871 1.0173 1.0094 0.9893 1.0067 1.0078 0.9978 0.9893 0.9902 0.9906
dispcorr: -0.024699277 hartree
energy: -2050.709300588390
dipole: 26.13381 -24.30621 1.82760 12.70951 -14.58497 -1.87546 17.74162 -16.27581 1.46582
magnitude: 3.00101 au
magnitude: 7.62796 debye
