program: Orca
programVersion: 5.0.2
elementType: Cl Cl O O O N C C C C C C C C C C C C C C C C C C C C C C H H H H H H H H H H H H H H H H H H H
charge: 0
multiplicity: 1
keywords: wb97x-d3
keywords: def2-TZVPP
keywords: def2/J RIJCOSX
keywords: DEFGRID2
keywords: scfconv7
keywords: smallprint printgap noloewdin
keywords: NOSOSCF
formula: C22H19Cl2NO3
InChI: InChI=1/C22H19Cl2NO3/c1-22(2)17(12-19(23)24)20(22)21(26)28-18(13-25)14-7-6-10-16(11-14)27-15-8-4-3-5-9-15/h3-12,17-18,20H,1-2H3
47 atoms
Cl -2.28624 -0.186581 3.011462
Cl -4.458962 0.54287 1.261756
O  1.590775 -1.77149 -1.226507
O  1.46076 -2.486952 0.884028
O  1.629767 3.200043 0.051525
N  3.994099 -1.015321 -3.360097
C  -1.376149 -3.500346 -0.007148
C  -1.489114 -2.195818 0.719905
C  -0.523069 -2.329374 -0.451502
C  -0.767257 -4.666055 0.732343
C  -2.455449 -3.919526 -0.976035
C  -2.650647 -1.310573 0.583016
C  0.915835 -2.228012 -0.157551
C  -3.064576 -0.442253 1.497776
C  2.950081 -1.415436 -0.999471
C  3.058258 -0.166738 -0.154728
C  3.518875 -1.198042 -2.330816
C  2.289087 0.941727 -0.491256
C  3.886397 -0.148098 0.955698
C  2.339082 2.069165 0.315195
C  3.948055 0.999034 1.735548
C  3.172355 2.10321 1.428785
C  0.459514 3.139327 -0.660951
C  -0.568652 2.275587 -0.302639
C  0.311849 4.02158 -1.72014
C  -1.750854 2.300011 -1.027847
C  -0.8825 4.044102 -2.427477
C  -1.914016 3.18037 -2.089536
H  -1.002753 -2.180013 1.688414
H  -0.828574 -1.866094 -1.382566
H  -0.239269 -5.328767 0.044115
H  -1.560285 -5.248066 1.205363
H  -0.073026 -4.367321 1.514169
H  -3.309327 -4.338817 -0.44062
H  -2.075216 -4.690008 -1.648822
H  -2.816963 -3.100698 -1.597183
H  -3.223581 -1.358348 -0.335196
H  3.507503 -2.236182 -0.536708
H  1.656748 0.919984 -1.370823
H  4.472071 -1.020377 1.215947
H  4.5907 1.025804 2.605558
H  3.207527 2.991145 2.047483
H  -0.457427 1.596489 0.534227
H  1.122358 4.689932 -1.982662
H  -2.55541 1.630862 -0.75349
H  -0.999966 4.737282 -3.250342
H  -2.842354 3.195323 -2.645155
elementType: Cl O N C H
totalener: -2050.68598029 hartree
nucrepener: 2890.50314959 hartree
electener: -4941.18912988 hartree
oneelecener: -8556.22547783 hartree
twoeener: 3615.03634796 hartree
cpcmener: -0.03100203 hartree
kineticenergy: 2044.47227750 hartree
xcener: -151.864945493745 hartree
chargesum: 0.0000000
charge: -0.057977 -0.062522 -0.284143 -0.438028 -0.324998 -0.086418 0.087801 0.047768 -0.062689 -0.266571 -0.273995 -0.222572 0.369031 0.054409 0.416940 0.021288 -0.230169 -0.211615 -0.209328 0.266138 -0.104478 -0.242021 0.283864 -0.193187 -0.241782 -0.113256 -0.118019 -0.198879 0.082428 0.100206 0.100214 0.097673 0.094762 0.104268 0.098826 0.093267 0.131542 0.140587 0.145955 0.145517 0.158276 0.147570 0.150482 0.146230 0.143775 0.157206 0.156622
qa: -0.0580 -0.0625 -0.2841 -0.4380 -0.3250 -0.0864 0.0878 0.0478 -0.0627 -0.2666 -0.2740 -0.2226 0.3690 0.0544 0.4169 0.0213 -0.2302 -0.2116 -0.2093 0.2661 -0.1045 -0.2420 0.2839 -0.1932 -0.2418 -0.1133 -0.1180 -0.1989 0.0824 0.1002 0.1002 0.0977 0.0948 0.1043 0.0988 0.0933 0.1315 0.1406 0.1460 0.1455 0.1583 0.1476 0.1505 0.1462 0.1438 0.1572 0.1566
va: 1.2628 1.2397 2.1261 2.0733 2.0910 3.1125 3.7837 3.8275 3.8080 3.9022 3.9116 3.8932 4.2086 4.1782 3.7309 3.6110 4.0803 3.9359 3.9728 3.7655 3.8978 4.0061 3.7300 3.9139 4.0135 3.8349 3.8819 3.9692 1.0499 1.0315 0.9996 0.9999 1.0188 0.9997 1.0016 1.0050 1.0183 1.0165 1.0160 1.0034 0.9890 1.0059 0.9979 1.0072 1.0089 0.9888 0.9919
dispcorr: -0.026982736 hartree
energy: -2050.712963022583
dipole: 5.88416 -7.10553 -1.22137 -13.97849 12.93172 -1.04677 -11.43115 11.70762 0.27647
magnitude: 1.63215 au
magnitude: 4.14860 debye
