program: Orca
programVersion: 5.0.2
elementType: Cl Cl O O O N C C C C C C C C C C C C C C C C C C C C C C H H H H H H H H H H H H H H H H H H H
charge: 0
multiplicity: 1
keywords: wb97x-d3
keywords: def2-TZVPP
keywords: def2/J RIJCOSX
keywords: DEFGRID2
keywords: scfconv7
keywords: smallprint printgap noloewdin
keywords: NOSOSCF
formula: C22H19Cl2NO3
InChI: InChI=1/C22H19Cl2NO3/c1-22(2)17(12-19(23)24)20(22)21(26)28-18(13-25)14-7-6-10-16(11-14)27-15-8-4-3-5-9-15/h3-12,17-18,20H,1-2H3
47 atoms
Cl -1.297364 -0.083588 -1.835435
Cl -3.31027 -1.060985 -3.666756
O  1.484246 -2.009037 0.288894
O  -0.019191 -1.317141 1.797799
O  0.512667 3.451542 -0.012249
N  4.787944 -2.069158 0.482577
C  -1.769608 -3.67075 0.615865
C  -2.130476 -2.363586 0.004596
C  -0.674939 -2.79354 0.030444
C  -1.903467 -3.83537 2.108777
C  -2.040876 -4.938082 -0.15721
C  -2.808322 -2.23013 -1.302713
C  0.250781 -1.974954 0.825272
C  -2.511754 -1.260107 -2.156698
C  2.411192 -1.013447 0.718974
C  2.238046 0.219474 -0.134405
C  3.736961 -1.614376 0.574379
C  1.515983 1.287501 0.383265
C  2.686848 0.237663 -1.44899
C  1.246019 2.383846 -0.427275
C  2.409842 1.338909 -2.24438
C  1.692502 2.412268 -1.742739
C  0.369353 3.699527 1.330667
C  1.474513 3.994208 2.118431
C  -0.909897 3.698098 1.863481
C  1.287055 4.286563 3.460883
C  -1.084981 4.004485 3.206735
C  0.009982 4.292906 4.008989
H  -2.368185 -1.574039 0.713288
H  -0.265128 -3.14495 -0.909238
H  -2.890388 -4.237447 2.345624
H  -1.792548 -2.901362 2.655116
H  -1.161586 -4.539545 2.489258
H  -1.89335 -4.816184 -1.230926
H  -3.067871 -5.272046 0.003979
H  -1.377634 -5.737752 0.176611
H  -3.591415 -2.930247 -1.57023
H  2.280047 -0.7737 1.777982
H  1.162199 1.251105 1.40564
H  3.246772 -0.594646 -1.85737
H  2.759451 1.365399 -3.267982
H  1.477093 3.271034 -2.366118
H  2.469603 3.997962 1.689621
H  -1.759269 3.4666 1.232836
H  2.145253 4.515659 4.079529
H  -2.083237 4.01114 3.62556
H  -0.130008 4.525602 5.056451
elementType: Cl O N C H
totalener: -2050.68325187 hartree
nucrepener: 2880.51145236 hartree
electener: -4931.19470424 hartree
oneelecener: -8537.03513959 hartree
twoeener: 3605.84043535 hartree
cpcmener: -0.02872263 hartree
kineticenergy: 2044.47627993 hartree
xcener: -151.863190577640 hartree
chargesum: 0.0000000
charge: -0.056730 -0.055598 -0.272351 -0.443306 -0.322023 -0.090167 0.138828 -0.044271 -0.112508 -0.268099 -0.279929 -0.223627 0.369717 0.091931 0.408994 -0.019751 -0.221000 -0.159712 -0.221001 0.274487 -0.114098 -0.235708 0.251521 -0.179225 -0.212273 -0.147311 -0.137434 -0.164924 0.116487 0.110073 0.096185 0.093829 0.100065 0.093508 0.102369 0.099916 0.141380 0.131559 0.137094 0.140175 0.158878 0.145876 0.156451 0.145785 0.159634 0.157682 0.158624
qa: -0.0567 -0.0556 -0.2724 -0.4433 -0.3220 -0.0902 0.1388 -0.0443 -0.1125 -0.2681 -0.2799 -0.2236 0.3697 0.0919 0.4090 -0.0198 -0.2210 -0.1597 -0.2210 0.2745 -0.1141 -0.2357 0.2515 -0.1792 -0.2123 -0.1473 -0.1374 -0.1649 0.1165 0.1101 0.0962 0.0938 0.1001 0.0935 0.1024 0.0999 0.1414 0.1316 0.1371 0.1402 0.1589 0.1459 0.1565 0.1458 0.1596 0.1577 0.1586
va: 1.2992 1.2510 2.1168 2.0589 2.0829 3.1088 3.7199 3.8776 3.8198 3.8868 3.9132 3.9112 4.1946 4.1788 3.7304 3.6879 4.0626 3.8641 3.9941 3.7166 3.9109 4.0039 3.7097 3.9364 4.0023 3.8914 3.8910 3.8921 1.0239 1.0258 1.0010 1.0181 0.9996 0.9992 0.9993 1.0029 1.0082 1.0233 1.0236 1.0089 0.9888 1.0073 0.9971 1.0067 0.9900 0.9898 0.9901
dispcorr: -0.026508867 hartree
energy: -2050.709760737983
dipole: 0.02506 -1.75959 -1.73454 -7.82827 7.49092 -0.33734 22.44583 -22.09162 0.35421
magnitude: 1.80219 au
magnitude: 4.58079 debye
