program: Orca
programVersion: 5.0.2
elementType: Cl Cl O O O N C C C C C C C C C C C C C C C C C C C C C C H H H H H H H H H H H H H H H H H H H
charge: 0
multiplicity: 1
keywords: wb97x-d3
keywords: def2-TZVPP
keywords: def2/J RIJCOSX
keywords: DEFGRID2
keywords: scfconv7
keywords: smallprint printgap noloewdin
keywords: NOSOSCF
formula: C22H19Cl2NO3
InChI: InChI=1/C22H19Cl2NO3/c1-22(2)17(12-19(23)24)20(22)21(26)28-18(13-25)14-7-6-10-16(11-14)27-15-8-4-3-5-9-15/h3-12,17-18,20H,1-2H3
47 atoms
Cl -3.781446 -2.952397 2.467741
Cl -5.590096 -2.229464 0.339946
O  1.45551 -1.615517 -1.103782
O  1.077485 -2.323911 0.98177
O  0.774054 3.433757 -0.699362
N  4.107024 -0.698576 -2.835597
C  -0.894368 -4.217461 -0.656975
C  -1.635304 -3.213411 0.180341
C  -0.532089 -2.747029 -0.74496
C  0.012289 -5.189839 0.055139
C  -1.551189 -4.807802 -1.880309
C  -3.019558 -2.824442 -0.117438
C  0.719641 -2.229504 -0.163294
C  -3.989222 -2.69093 0.77894
C  2.675167 -1.018686 -0.673973
C  2.437693 0.302604 0.015773
C  3.463889 -0.843507 -1.895154
C  1.751497 1.308468 -0.654488
C  2.882331 0.498603 1.314262
C  1.501499 2.509251 -0.010959
C  2.626781 1.708126 1.945624
C  1.931309 2.714831 1.296499
C  1.056826 4.768069 -0.575996
C  2.360516 5.249073 -0.571218
C  -0.021091 5.639587 -0.519138
C  2.57594 6.617587 -0.497004
C  0.210073 7.006444 -0.458078
C  1.506498 7.501396 -0.439645
H  -1.367989 -3.224575 1.23095
H  -0.836838 -2.258344 -1.663708
H  0.41449 -4.801881 0.988858
H  0.851424 -5.476475 -0.581973
H  -0.543749 -6.09812 0.294434
H  -2.219427 -5.623908 -1.599094
H  -0.794581 -5.216021 -2.552704
H  -2.13124 -4.081347 -2.448056
H  -3.280172 -2.626484 -1.150423
H  3.236403 -1.692399 -0.018543
H  1.4064 1.168054 -1.672925
H  3.417312 -0.286185 1.833181
H  2.960969 1.865409 2.962628
H  1.724492 3.645781 1.809034
H  3.202896 4.571063 -0.630836
H  -1.031292 5.249759 -0.528197
H  3.591199 6.992824 -0.492487
H  -0.631909 7.685283 -0.416537
H  1.68292 8.567509 -0.385424
elementType: Cl O N C H
totalener: -2050.68686067 hartree
nucrepener: 2674.73287987 hartree
electener: -4725.41974055 hartree
oneelecener: -8125.08232472 hartree
twoeener: 3399.66258417 hartree
cpcmener: -0.03120435 hartree
kineticenergy: 2044.47111821 hartree
xcener: -151.862536227473 hartree
chargesum: -0.0000000
charge: -0.055396 -0.059610 -0.280670 -0.440013 -0.326896 -0.087922 0.082609 0.031401 -0.081884 -0.262114 -0.261010 -0.204517 0.389855 0.040636 0.417896 0.006287 -0.228637 -0.232517 -0.184708 0.231937 -0.128898 -0.175510 0.268798 -0.180575 -0.238815 -0.149265 -0.126524 -0.179199 0.079363 0.099231 0.093628 0.100918 0.098673 0.101753 0.098961 0.090623 0.131323 0.139965 0.136694 0.146020 0.160809 0.158766 0.157418 0.146216 0.159328 0.157521 0.158048
qa: -0.0554 -0.0596 -0.2807 -0.4400 -0.3269 -0.0879 0.0826 0.0314 -0.0819 -0.2621 -0.2610 -0.2045 0.3899 0.0406 0.4179 0.0063 -0.2286 -0.2325 -0.1847 0.2319 -0.1289 -0.1755 0.2688 -0.1806 -0.2388 -0.1493 -0.1265 -0.1792 0.0794 0.0992 0.0936 0.1009 0.0987 0.1018 0.0990 0.0906 0.1313 0.1400 0.1367 0.1460 0.1608 0.1588 0.1574 0.1462 0.1593 0.1575 0.1580
va: 1.2700 1.2453 2.1347 2.0760 2.0746 3.1111 3.7514 3.8557 3.8385 3.9083 3.9060 3.8980 4.2054 4.2114 3.7214 3.6136 4.0748 4.0770 3.9598 3.8060 3.9046 3.9197 3.7008 3.9011 4.0031 3.8943 3.8898 3.9006 1.0500 1.0322 1.0172 0.9997 1.0004 1.0010 1.0019 1.0054 1.0172 1.0151 1.0255 1.0055 0.9905 0.9943 0.9965 1.0077 0.9904 0.9893 0.9904
dispcorr: -0.022725241 hartree
energy: -2050.709585914115
dipole: 22.40086 -22.52912 -0.12827 5.79074 -5.82059 -0.02985 -8.15395 8.62436 0.47041
magnitude: 0.48849 au
magnitude: 1.24165 debye
