program: Orca
programVersion: 5.0.2
elementType: Cl Cl O O O N C C C C C C C C C C C C C C C C C C C C C C H H H H H H H H H H H H H H H H H H H
charge: 0
multiplicity: 1
keywords: wb97x-d3
keywords: def2-TZVPP
keywords: def2/J RIJCOSX
keywords: DEFGRID2
keywords: scfconv7
keywords: smallprint printgap noloewdin
keywords: NOSOSCF
formula: C22H19Cl2NO3
InChI: InChI=1/C22H19Cl2NO3/c1-22(2)17(12-19(23)24)20(22)21(26)28-18(13-25)14-7-6-10-16(11-14)27-15-8-4-3-5-9-15/h3-12,17-18,20H,1-2H3
47 atoms
Cl -1.28706 -0.316593 -1.994789
Cl -3.275064 -1.40302 -3.789447
O  1.444395 -2.012411 0.317727
O  -0.116944 -1.306724 1.756574
O  0.381428 3.50903 0.141512
N  4.748194 -1.875053 0.43722
C  -1.769994 -3.759803 0.642693
C  -2.149924 -2.489361 -0.031102
C  -0.684357 -2.87945 0.042345
C  -1.92337 -3.869735 2.13867
C  -2.00087 -5.062451 -0.08423
C  -2.80456 -2.432315 -1.355959
C  0.196617 -1.998252 0.821642
C  -2.495785 -1.512726 -2.259884
C  2.318259 -0.967391 0.738185
C  2.065551 0.262998 -0.099958
C  3.674313 -1.487281 0.5586
C  1.39817 1.339569 0.468576
C  2.398819 0.266198 -1.449455
C  1.075681 2.434841 -0.324731
C  2.063714 1.362067 -2.228208
C  1.40548 2.448203 -1.673478
C  0.455682 3.873129 1.460612
C  1.675062 4.033971 2.106916
C  -0.736425 4.143973 2.115395
C  1.689068 4.4618 3.426287
C  -0.706651 4.583131 3.431608
C  0.50277 4.737288 4.094159
H  -2.422282 -1.675206 0.636116
H  -0.242903 -3.258455 -0.8720
H  -1.161791 -4.529694 2.558086
H  -2.898168 -4.299133 2.377669
H  -1.856067 -2.911054 2.648277
H  -3.026193 -5.406197 0.066838
H  -1.333643 -5.837362 0.296675
H  -1.830669 -4.981106 -1.158331
H  -3.583382 -3.147331 -1.595194
H  2.196496 -0.74462 1.802086
H  1.127342 1.313009 1.516523
H  2.914326 -0.574926 -1.896778
H  2.321155 1.376145 -3.278988
H  1.144946 3.304754 -2.282489
H  2.605858 3.833885 1.590179
H  -1.67828 4.018125 1.595874
H  2.638004 4.585407 3.932214
H  -1.637753 4.797235 3.940485
H  0.522402 5.071934 5.12293
elementType: Cl O N C H
totalener: -2050.68321109 hartree
nucrepener: 2860.96636950 hartree
electener: -4911.64958059 hartree
oneelecener: -8497.91441835 hartree
twoeener: 3586.26483777 hartree
cpcmener: -0.02877369 hartree
kineticenergy: 2044.47721506 hartree
xcener: -151.863988451615 hartree
chargesum: 0.0000000
charge: -0.054968 -0.056533 -0.273552 -0.443658 -0.323800 -0.088646 0.137216 -0.039031 -0.114738 -0.268526 -0.280446 -0.225421 0.367796 0.092873 0.415228 -0.004820 -0.224726 -0.166225 -0.225680 0.287180 -0.124184 -0.237507 0.280062 -0.195099 -0.240157 -0.138759 -0.123084 -0.181183 0.115954 0.111601 0.100482 0.095876 0.094056 0.103011 0.099754 0.093876 0.140917 0.131487 0.140377 0.140167 0.158189 0.146257 0.156766 0.146094 0.159272 0.157929 0.158325
qa: -0.0550 -0.0565 -0.2736 -0.4437 -0.3238 -0.0886 0.1372 -0.0390 -0.1147 -0.2685 -0.2804 -0.2254 0.3678 0.0929 0.4152 -0.0048 -0.2247 -0.1662 -0.2257 0.2872 -0.1242 -0.2375 0.2801 -0.1951 -0.2402 -0.1388 -0.1231 -0.1812 0.1160 0.1116 0.1005 0.0959 0.0941 0.1030 0.0998 0.0939 0.1409 0.1315 0.1404 0.1402 0.1582 0.1463 0.1568 0.1461 0.1593 0.1579 0.1583
va: 1.3018 1.2500 2.1224 2.0588 2.0860 3.1100 3.7208 3.8734 3.8203 3.8879 3.9136 3.9115 4.1986 4.1784 3.7311 3.6376 4.0647 3.8974 3.9798 3.7262 3.8967 4.0049 3.6897 3.9265 4.0148 3.8854 3.8829 3.9047 1.0244 1.0248 0.9994 1.0010 1.0178 0.9990 1.0032 0.9991 1.0087 1.0220 1.0197 1.0097 0.9900 1.0068 0.9967 1.0076 0.9900 0.9893 0.9905
dispcorr: -0.026287467 hartree
energy: -2050.709498558647
dipole: 0.58786 -2.23742 -1.64955 -6.08010 5.65398 -0.42612 23.59309 -23.21693 0.37616
magnitude: 1.74474 au
magnitude: 4.43477 debye
