program: Orca
programVersion: 5.0.2
elementType: Cl Cl O O O N C C C C C C C C C C C C C C C C C C C C C C H H H H H H H H H H H H H H H H H H H
charge: 0
multiplicity: 1
keywords: wb97x-d3
keywords: def2-TZVPP
keywords: def2/J RIJCOSX
keywords: DEFGRID2
keywords: scfconv7
keywords: smallprint printgap noloewdin
keywords: NOSOSCF
formula: C22H19Cl2NO3
InChI: InChI=1/C22H19Cl2NO3/c1-22(2)17(12-19(23)24)20(22)21(26)28-18(13-25)14-7-6-10-16(11-14)27-15-8-4-3-5-9-15/h3-12,17-18,20H,1-2H3
47 atoms
Cl -0.995843 -5.377488 -1.084115
Cl -3.799547 -5.677574 -0.479681
O  0.732269 -0.97056 0.29254
O  -0.510578 0.491107 1.438034
O  2.255431 4.498778 0.317617
N  3.754966 -2.224778 0.663185
C  -1.814437 -0.97258 -1.52146
C  -1.562544 -2.285548 -0.832325
C  -1.60758 -1.007429 -0.019641
C  -0.735395 -0.443372 -2.435505
C  -3.20384 -0.607933 -1.985347
C  -2.628651 -3.275438 -0.635111
C  -0.432876 -0.412084 0.644594
C  -2.484026 -4.591549 -0.722621
C  1.923228 -0.367874 0.797348
C  2.294533 0.853231 -0.008088
C  2.943616 -1.41351 0.709912
C  2.139696 2.105137 0.568179
C  2.717144 0.728721 -1.327479
C  2.379862 3.241591 -0.194112
C  2.980017 1.870615 -2.066324
C  2.802513 3.129269 -1.510648
C  1.25667 4.783229 1.211206
C  1.571881 5.643791 2.25288
C  -0.034158 4.287641 1.064226
C  0.585224 6.011616 3.156584
C  -1.006352 4.653811 1.983747
C  -0.704511 5.513594 3.031608
H  -0.574176 -2.695596 -0.999677
H  -2.510942 -0.836827 0.555838
H  -0.689696 0.646675 -2.397181
H  -0.961549 -0.72531 -3.465095
H  0.253636 -0.833387 -2.208236
H  -3.984615 -0.901176 -1.28473
H  -3.422023 -1.07735 -2.946504
H  -3.280603 0.472479 -2.120093
H  -3.619768 -2.910652 -0.392269
H  1.813385 -0.11038 1.855218
H  1.825609 2.188243 1.600952
H  2.842871 -0.247215 -1.780618
H  3.314078 1.783729 -3.091749
H  2.994022 4.021042 -2.094005
H  2.581154 6.024362 2.351622
H  -0.288127 3.624881 0.246145
H  0.832893 6.684823 3.967283
H  -2.01049 4.264849 1.872488
H  -1.469789 5.795511 3.742797
elementType: Cl O N C H
totalener: -2050.68409073 hartree
nucrepener: 2765.98173370 hartree
electener: -4816.66582444 hartree
oneelecener: -8307.05873511 hartree
twoeener: 3490.39291067 hartree
cpcmener: -0.03149346 hartree
kineticenergy: 2044.46558706 hartree
xcener: -151.863281502568 hartree
chargesum: -0.0000000
charge: -0.055159 -0.060098 -0.265561 -0.441437 -0.327260 -0.086829 0.095212 0.046943 -0.095443 -0.273724 -0.271415 -0.220677 0.412739 0.046863 0.363713 0.049213 -0.220499 -0.181620 -0.275609 0.280287 -0.106174 -0.228287 0.290547 -0.251883 -0.195679 -0.119351 -0.140745 -0.185666 0.087370 0.100386 0.103908 0.102107 0.091235 0.091280 0.100946 0.099396 0.128207 0.139150 0.144525 0.147470 0.159403 0.148061 0.146117 0.154382 0.157453 0.158600 0.157601
qa: -0.0552 -0.0601 -0.2656 -0.4414 -0.3273 -0.0868 0.0952 0.0469 -0.0954 -0.2737 -0.2714 -0.2207 0.4127 0.0469 0.3637 0.0492 -0.2205 -0.1816 -0.2756 0.2803 -0.1062 -0.2283 0.2905 -0.2519 -0.1957 -0.1194 -0.1407 -0.1857 0.0874 0.1004 0.1039 0.1021 0.0912 0.0913 0.1009 0.0994 0.1282 0.1392 0.1445 0.1475 0.1594 0.1481 0.1461 0.1544 0.1575 0.1586 0.1576
va: 1.2705 1.2448 2.1334 2.0591 2.0860 3.1094 3.7267 3.8471 3.8555 3.9107 3.9108 3.8943 4.1877 4.2159 3.7812 3.5410 4.0579 3.9372 3.9791 3.7402 3.8974 4.0299 3.6848 4.0114 3.8997 3.8818 3.8947 3.9101 1.0365 1.0286 0.9982 1.0022 1.0093 1.0061 1.0009 1.0002 1.0205 1.0174 1.0139 1.0051 0.9889 1.0048 1.0080 1.0021 0.9891 0.9911 0.9904
dispcorr: -0.025612655 hartree
energy: -2050.709703388739
dipole: 0.36995 -1.87494 -1.50500 38.63604 -37.01062 1.62541 -4.26439 3.42716 -0.83723
magnitude: 2.36811 au
magnitude: 6.01925 debye
