program: Gaussian 09
title: 000072711
version: EM64L-G09RevD.01
frameworkgroup: C1[X(C6H6ClN3O)]
method: RPBEPBE
basis: SDD
operation: Freq
keyword: #p
keyword: freq=noraman
keyword: PBEPBE/SDD
title: #p freq=noraman PBEPBE/SDD
converged: NO YES NO NO
title: Mulliken charges:
elementType: Cl O N N N C C C C C C H H H H H H
charge: -0.021613 -0.264783 -0.065372 -0.374472 -0.505117 0.033988 -0.239267 0.171753 -0.038612 -0.146938 -0.342743 0.306499 0.261139 0.253006 0.360649 0.305761 0.306121
chargesum: 0.00000
title: Mulliken charges with hydrogens summed into heavy atoms:
elementType: Cl O N N N C C C C C C
charge: -0.021613 -0.264783 -0.065372 -0.013823 0.106765 0.033988 0.067231 0.171753 -0.038612 0.114202 -0.089737
polarizability: 1.47422011e+02 -2.73227742e+00 1.02884457e+02 -5.41879279e-02 4.02448246e-02 4.24991928e+01
1716.lowfreq: -87.3390 -6.3249 0.0010 0.0024 0.0030 6.2205 7.1722 58.4684 118.9079
frequency: -87.1734 58.4262 118.9024 122.5585 183.1106 219.7898 224.6654 308.0908 342.6941 397.9936 423.1155 488.7564 522.7795 678.4956 692.4079 720.1010 727.6142 757.8710 777.5750 840.1003 888.8347 936.4503 961.0940 963.6831 1071.6721 1079.2459 1093.8898 1205.1940 1249.6291 1281.6187 1285.0985 1312.9184 1377.7790 1435.1764 1468.3933 1544.9657 1563.0188 1610.9471 1673.2080 3147.2405 3180.6311 3185.4350 3398.2402 3512.8739 3516.6219
redmass: 1.2189 8.6160 3.3227 7.1474 6.2829 3.9660 7.0438 5.1822 7.2158 9.8703 3.0895 7.4220 6.2239 7.4466 5.2407 1.1549 7.8856 1.6044 3.5843 1.3674 7.6505 1.4202 1.4063 7.0828 1.8514 4.0783 1.6437 3.2530 1.7223 1.1623 1.7980 6.9737 3.1795 2.0214 2.1378 6.8829 7.4928 9.9877 1.0627 1.0905 1.0936 1.0968 1.0427 1.0793 1.0990
irintensity: 43.8879 2.7454 2.0308 0.7780 6.5720 3.3452 2.5873 39.8994 3.2390 1.9052 2.9891 0.3730 16.9124 19.0453 12.3990 146.4778 46.4987 158.6652 1.3159 32.9582 0.0804 14.1105 0.1435 0.5733 2.1992 24.8690 1.8873 21.9021 21.6338 0.1569 12.7218 0.9497 8.2451 47.7862 267.7764 103.4476 52.8323 132.2526 28.2123 13.6122 4.2751 4.6171 0.3130 55.2352 2.3803
temp: 298.150 k
press: 1.00000 atm
elementType: 17 8 7 7 7 6 6 6 6 6 6 1 1 1 1 1 1
symmnumber: 1
zpe: 314312.3 jmol-1
zpe.correction: 0.119715 hartree
zpe.thermalcorrener: 0.129272 hartree
zpe.thermalcorrenthalpy: 0.130216 hartree
zpe.thermalcorrgfe: 0.083802 hartree
zpe.sumelectzpe: -930.958925 hartree
zpe.sumelectthermal: -930.949368 hartree
zpe.sumelectthermalent: -930.948424 hartree
zpe.sumelectthermalfe: -930.994838 hartree
dipole: 1.0376 2.4105 0.0250
dipole: 2.6244
quadrupole: -68.4551 -70.5894 -70.1677
quadrupole: 5.5962 -0.1389 0.0199
quadrupole: 1.2823 -0.8520 -0.4303 5.5962 -0.1389 0.0199
hfenergy: -931.0786401 hartree
pointgroup: C01 [X(C6H6Cl1N3O1)]
dipole: -0.5480822 0.8749771 -0.0121161 debye
dipolederiv: -0.6018054 -0.3460449 0.0009339 -0.4054599 -0.3931502 0.0008842 0.0011243 0.000844 -0.0533269 -0.6933875 0.1964387 -0.0006464 -0.0383555 -0.8850065 0.0033527 0.0002761 0.0018287 -0.3597862 -0.5064952 -0.0001431 0.0001098 -0.0241404 -0.4181742 0.0004029 0.0008534 0.0008157 -0.2062761 -0.4633596 -0.2640014 0.0029321 -0.4252804 -0.5027256 0.0045103 -0.0000287 0.0042715 -0.426791 -0.2498653 -0.1299469 -0.0027446 -0.2210045 -0.3710356 -0.0035871 -0.0008989 -0.0014505 -0.0384144 0.1321165 -0.0430523 -0.0001291 0.2712399 0.1771933 -0.0004063 0.002183 0.0006234 0.0377228 -0.6206516 -0.1469766 0.0004889 -0.1544078 -0.1292983 0.0003036 -0.0010868 -0.0000024 -0.0273671 1.1458529 0.115441 -0.0021148 0.2181698 1.1449968 -0.0064384 0.0009572 -0.0039149 0.1891528 1.0573123 0.5457097 -0.0015377 0.5764226 0.6986416 -0.0018847 -0.0021728 -0.0019241 -0.0422804 -0.192796 -0.2377645 0.000603 -0.1217732 -0.4189718 0.0008207 0.0005099 0.000935 -0.0648053 0.1745685 0.1714516 -0.0003234 -0.1445426 0.4003784 -0.0010689 -0.0001658 -0.0013085 -0.063994 0.1812925 0.0228471 -0.0000615 -0.0009268 0.0641998 0.0002295 0.0004806 0.0003339 0.1685142 -0.00917 0.0517977 -0.0001171 0.0303319 0.1022364 0.0001388 0.0000725 0.000176 0.169759 0.04981 0.0234796 -0.0000329 0.0599622 -0.0827481 0.0005219 -0.0002246 0.000513 0.1388945 0.2860246 0.0160433 0.0001113 0.0395176 0.2342773 0.0001033 -0.0046632 -0.0022333 0.3436423 0.156214 0.014109 -0.0464268 0.1752905 0.1935428 -0.146866 -0.0501405 -0.087251 0.1140238 0.1543396 0.0106119 0.0489555 0.1649565 0.1856439 0.1489834 0.0529242 0.0877437 0.1213321 unknown
polarizability: 145.5626237|9.3173669|104.7430193|-0.1097289|-0.226125|42.5000179 unknown
InChI: InChI=1S/C6H6ClN3O/c7-4-1-2-9-5(3-4)6(11)10-8/h1-3,10H,8H2
charge 0 multiplicity 1
17 atoms
Cl -3.497717 -1.569139 0.00527
O  1.989011 -1.57165 0.006456
N  -0.003464 1.471477 -0.00226
N  2.580314 0.693605 -0.004117
N  3.98323 0.490299 -0.002049
C  0.228333 0.120899 0.000987
C  -0.799277 -0.850348 0.003397
C  1.66859 -0.342064 0.00195
C  -2.12584 -0.384736 0.002255
C  -2.401603 0.997627 -0.001076
C  -1.299233 1.885952 -0.003209
H  -0.530885 -1.910022 0.006117
H  -3.42636 1.376964 -0.001894
H  -1.464928 2.968282 -0.005793
H  2.232976 1.657442 -0.003691
H  4.276412 -0.009354 -0.853165
H  4.270042 -0.030836 0.838222
