program: Orca
programVersion: 5.0.2
elementType: Cl Cl O O O N C C C C C C C C C C C C C C C C C C C C C C H H H H H H H H H H H H H H H H H H H
charge: 0
multiplicity: 1
keywords: wb97x-d3
keywords: def2-TZVPP
keywords: def2/J RIJCOSX
keywords: DEFGRID2
keywords: scfconv7
keywords: smallprint printgap noloewdin
keywords: NOSOSCF
formula: C22H19Cl2NO3
InChI: InChI=1/C22H19Cl2NO3/c1-22(2)17(12-19(23)24)20(22)21(26)28-18(13-25)14-7-6-10-16(11-14)27-15-8-4-3-5-9-15/h3-12,17-18,20H,1-2H3
47 atoms
Cl -4.642422 -1.616443 0.256089
Cl -5.174453 -2.111032 -2.535875
O  1.788001 -2.028718 -0.460498
O  0.339323 -1.575607 1.181137
O  2.011853 3.223938 1.760666
N  5.076955 -2.274618 -0.592448
C  -1.001494 -4.130871 -0.195319
C  -1.824791 -2.88145 -0.341877
C  -0.360467 -2.859217 -0.71822
C  -0.703348 -4.616719 1.201248
C  -1.161422 -5.25377 -1.190374
C  -2.834219 -2.742802 -1.399092
C  0.577769 -2.085958 0.117617
C  -4.04605 -2.226442 -1.239208
C  2.798264 -1.297183 0.230272
C  2.711017 0.181126 -0.059948
C  4.067289 -1.853764 -0.243594
C  2.389616 1.058258 0.964043
C  2.915322 0.650472 -1.35352
C  2.292807 2.419253 0.698587
C  2.821782 2.009209 -1.601847
C  2.517389 2.902361 -0.584212
C  1.390293 4.43033 1.560938
C  0.202216 4.522668 0.846629
C  1.958795 5.550951 2.145712
C  -0.407327 5.760388 0.706988
C  1.330055 6.781349 2.010166
C  0.15295 6.892784 1.284214
H  -2.057887 -2.386717 0.594096
H  -0.119437 -2.869053 -1.775584
H  -1.466637 -5.333478 1.509519
H  -0.690146 -3.820541 1.94311
H  0.260634 -5.128101 1.235443
H  -1.279806 -4.906291 -2.216025
H  -2.032681 -5.862447 -0.940995
H  -0.285941 -5.904966 -1.167485
H  -2.580371 -3.087655 -2.394358
H  2.748277 -1.478842 1.3082
H  2.219393 0.693427 1.969856
H  3.15853 -0.030568 -2.159851
H  2.995543 2.386876 -2.600769
H  2.463583 3.961427 -0.800348
H  -0.246048 3.641424 0.404418
H  2.882387 5.459996 2.70358
H  -1.330883 5.836209 0.147691
H  1.772799 7.657461 2.466145
H  -0.328926 7.855131 1.172182
elementType: Cl O N C H
totalener: -2050.68677283 hartree
nucrepener: 2678.54636914 hartree
electener: -4729.23314197 hartree
oneelecener: -8132.58199361 hartree
twoeener: 3403.34885164 hartree
cpcmener: -0.03066945 hartree
kineticenergy: 2044.46936743 hartree
xcener: -151.862206586379 hartree
chargesum: -0.0000000
charge: -0.055388 -0.059968 -0.276097 -0.443999 -0.325228 -0.088210 0.084665 0.031044 -0.088263 -0.261864 -0.263124 -0.206219 0.402585 0.041722 0.399313 0.003719 -0.223142 -0.207724 -0.212228 0.261727 -0.151140 -0.173318 0.257867 -0.182012 -0.227060 -0.145220 -0.129747 -0.173163 0.078430 0.100097 0.099009 0.093575 0.101403 0.090680 0.102182 0.098786 0.130224 0.138185 0.133921 0.147324 0.161120 0.155715 0.158364 0.146542 0.159356 0.157022 0.158539
qa: -0.0554 -0.0600 -0.2761 -0.4440 -0.3252 -0.0882 0.0847 0.0310 -0.0883 -0.2619 -0.2631 -0.2062 0.4026 0.0417 0.3993 0.0037 -0.2231 -0.2077 -0.2122 0.2617 -0.1511 -0.1733 0.2579 -0.1820 -0.2271 -0.1452 -0.1297 -0.1732 0.0784 0.1001 0.0990 0.0936 0.1014 0.0907 0.1022 0.0988 0.1302 0.1382 0.1339 0.1473 0.1611 0.1557 0.1584 0.1465 0.1594 0.1570 0.1585
va: 1.2701 1.2449 2.1372 2.0711 2.0783 3.1110 3.7521 3.8566 3.8339 3.9092 3.9056 3.9000 4.2070 4.2108 3.7313 3.6296 4.0701 4.0466 3.9864 3.7866 3.9318 3.9077 3.7043 3.9231 4.0043 3.8880 3.8880 3.8966 1.0514 1.0313 1.0004 1.0168 0.9995 1.0057 1.0009 1.0017 1.0179 1.0184 1.0252 1.0082 0.9913 0.9968 0.9952 1.0066 0.9902 0.9896 0.9902
dispcorr: -0.022691102 hartree
energy: -2050.709463932460
dipole: 19.51769 -20.23208 -0.71439 2.41193 -2.12760 0.28432 4.91343 -5.56785 -0.65443
magnitude: 1.00969 au
magnitude: 2.56642 debye
