program: Orca
programVersion: 5.0.2
elementType: Cl Cl O O O N C C C C C C C C C C C C C C C C C C C C C C H H H H H H H H H H H H H H H H H H H
charge: 0
multiplicity: 1
keywords: wb97x-d3
keywords: def2-TZVPP
keywords: def2/J RIJCOSX
keywords: DEFGRID2
keywords: scfconv7
keywords: smallprint printgap noloewdin
keywords: NOSOSCF
formula: C22H19Cl2NO3
InChI: InChI=1/C22H19Cl2NO3/c1-22(2)17(12-19(23)24)20(22)21(26)28-18(13-25)14-7-6-10-16(11-14)27-15-8-4-3-5-9-15/h3-12,17-18,20H,1-2H3
47 atoms
Cl -1.426393 0.335837 2.452636
Cl -4.059581 0.743409 1.339438
O  1.347454 -1.89093 -1.215189
O  1.491721 -2.704555 0.860751
O  0.966745 2.834541 0.622749
N  3.447951 -0.944086 -3.573621
C  -1.435768 -3.74104 0.344499
C  -1.488263 -2.393784 0.983706
C  -0.628562 -2.61216 -0.261282
C  -0.757611 -4.858197 1.098398
C  -2.593012 -4.218404 -0.499576
C  -2.638714 -1.48367 0.886154
C  0.823088 -2.445505 -0.105662
C  -2.699543 -0.301092 1.485607
C  2.687898 -1.442254 -1.123951
C  2.822874 -0.190372 -0.282671
C  3.09513 -1.167908 -2.503936
C  1.793572 0.742813 -0.259571
C  3.988561 0.017546 0.438399
C  1.945208 1.896388 0.498563
C  4.126485 1.17836 1.185728
C  3.113161 2.120981 1.218171
C  0.047732 3.029089 -0.375539
C  0.430349 3.185477 -1.702442
C  -1.2841 3.134792 -0.003013
C  -0.54032 3.439905 -2.659933
C  -2.243028 3.401741 -0.970123
C  -1.877738 3.54918 -2.300761
H  -0.909615 -2.308365 1.897111
H  -1.02729 -2.209197 -1.184765
H  -0.266958 -5.549453 0.410814
H  -1.506056 -5.425033 1.655042
H  -0.016472 -4.508792 1.813405
H  -3.391232 -4.613696 0.131534
H  -2.266335 -5.02133 -1.162565
H  -3.017408 -3.43543 -1.127686
H  -3.487657 -1.775358 0.279331
H  3.34966 -2.225844 -0.73967
H  0.882307 0.571295 -0.81884
H  4.780919 -0.720286 0.420114
H  5.032402 1.350564 1.751662
H  3.218798 3.024897 1.80467
H  1.472013 3.114804 -1.991478
H  -1.565751 3.020614 1.03569
H  -0.243638 3.561635 -3.693902
H  -3.281655 3.488122 -0.677887
H  -2.628421 3.753095 -3.052924
elementType: Cl O N C H
totalener: -2050.68427429 hartree
nucrepener: 2930.51218382 hartree
electener: -4981.19645811 hartree
oneelecener: -8636.88644730 hartree
twoeener: 3655.68998919 hartree
cpcmener: -0.03070181 hartree
kineticenergy: 2044.47284406 hartree
xcener: -151.865475453147 hartree
chargesum: -0.0000000
charge: -0.055863 -0.056780 -0.290652 -0.436751 -0.321471 -0.087194 0.124573 -0.053955 -0.046564 -0.266175 -0.283622 -0.158480 0.356483 0.045393 0.406471 0.024724 -0.229136 -0.204702 -0.220601 0.273749 -0.103552 -0.247208 0.305194 -0.199889 -0.266641 -0.137614 -0.113063 -0.185435 0.100109 0.100618 0.101378 0.096379 0.094711 0.106316 0.100438 0.090655 0.133220 0.145929 0.141917 0.144481 0.158627 0.147195 0.155473 0.141792 0.159660 0.152722 0.157141
qa: -0.0559 -0.0568 -0.2907 -0.4368 -0.3215 -0.0872 0.1246 -0.0540 -0.0466 -0.2662 -0.2836 -0.1585 0.3565 0.0454 0.4065 0.0247 -0.2291 -0.2047 -0.2206 0.2737 -0.1036 -0.2472 0.3052 -0.1999 -0.2666 -0.1376 -0.1131 -0.1854 0.1001 0.1006 0.1014 0.0964 0.0947 0.1063 0.1004 0.0907 0.1332 0.1459 0.1419 0.1445 0.1586 0.1472 0.1555 0.1418 0.1597 0.1527 0.1571
va: 1.2738 1.2497 2.1078 2.0736 2.0828 3.1135 3.8061 3.9028 3.7911 3.8874 3.9167 3.8914 4.2053 4.1806 3.7271 3.6486 4.0688 3.9401 3.9987 3.7206 3.8926 4.0167 3.6815 3.9294 3.9824 3.8831 3.8882 3.9337 1.0376 1.0316 0.9993 1.0006 1.0182 0.9989 1.0016 1.0027 1.0177 1.0164 1.0197 1.0024 0.9889 1.0064 0.9977 1.0246 0.9895 0.9969 0.9909
dispcorr: -0.027591423 hartree
energy: -2050.711865710207
dipole: 3.22856 -4.37956 -1.15100 -16.07358 15.00001 -1.07357 -9.11951 9.46266 0.34316
magnitude: 1.61093 au
magnitude: 4.09467 debye
