program: Orca
programVersion: 5.0.2
elementType: Cl Cl O O O N C C C C C C C C C C C C C C C C C C C C C C H H H H H H H H H H H H H H H H H H H
charge: 0
multiplicity: 1
keywords: wb97x-d3
keywords: def2-TZVPP
keywords: def2/J RIJCOSX
keywords: DEFGRID2
keywords: scfconv7
keywords: smallprint printgap noloewdin
keywords: NOSOSCF
formula: C22H19Cl2NO3
InChI: InChI=1/C22H19Cl2NO3/c1-22(2)17(12-19(23)24)20(22)21(26)28-18(13-25)14-7-6-10-16(11-14)27-15-8-4-3-5-9-15/h3-12,17-18,20H,1-2H3
47 atoms
Cl -4.930762 -2.790327 0.270551
Cl -5.241557 -3.083575 -2.584513
O  1.548474 -1.787393 -0.393733
O  0.067109 -1.596897 1.273921
O  2.602237 3.745682 1.497485
N  4.834314 -1.672863 -0.488796
C  -0.843739 -4.328622 -0.148928
C  -1.867417 -3.236599 -0.298345
C  -0.423631 -2.957411 -0.642904
C  -0.498811 -4.774374 1.249511
C  -0.776174 -5.44407 -1.162127
C  -2.85353 -3.247809 -1.386925
C  0.372401 -2.049363 0.202721
C  -4.159338 -3.062922 -1.243852
C  2.450003 -0.916607 0.268315
C  2.235492 0.532557 -0.106961
C  3.781862 -1.34931 -0.16252
C  2.442963 1.508328 0.854476
C  1.886242 0.883315 -1.405985
C  2.321731 2.850369 0.512571
C  1.756039 2.224538 -1.727674
C  1.978272 3.216351 -0.782479
C  2.092962 5.018426 1.449021
C  2.984526 6.074029 1.559644
C  0.725452 5.244722 1.361848
C  2.49817 7.373969 1.591581
C  0.2541 6.548846 1.383451
C  1.135106 7.61663 1.499097
H  -2.205483 -2.809882 0.639396
H  -0.173588 -2.915271 -1.697455
H  0.531904 -5.131115 1.299041
H  -1.147476 -5.602752 1.53994
H  -0.621733 -3.990705 1.994681
H  -0.945892 -5.10568 -2.183662
H  -1.517612 -6.212835 -0.936589
H  0.2079 -5.915374 -1.135128
H  -2.492145 -3.418001 -2.394425
H  2.399547 -1.036998 1.355456
H  2.708599 1.234876 1.869069
H  1.724817 0.128681 -2.164508
H  1.490036 2.509789 -2.737013
H  1.889826 4.256904 -1.066643
H  4.047436 5.879002 1.628997
H  0.033516 4.414987 1.284449
H  3.192634 8.198973 1.684334
H  -0.811108 6.72869 1.317125
H  0.759907 8.63127 1.521682
elementType: Cl O N C H
totalener: -2050.68626026 hartree
nucrepener: 2635.80952349 hartree
electener: -4686.49578375 hartree
oneelecener: -8046.92092920 hartree
twoeener: 3360.42514545 hartree
cpcmener: -0.03160987 hartree
kineticenergy: 2044.47011306 hartree
xcener: -151.862108317479 hartree
chargesum: -0.0000000
charge: -0.054847 -0.059638 -0.281460 -0.435977 -0.322622 -0.087820 0.086801 0.029373 -0.090754 -0.262404 -0.256410 -0.199209 0.383305 0.034852 0.385961 0.041477 -0.224074 -0.243650 -0.206675 0.274097 -0.152920 -0.175463 0.253317 -0.223502 -0.181908 -0.132377 -0.145852 -0.170023 0.081606 0.100765 0.100945 0.099668 0.093948 0.089415 0.101485 0.098931 0.132003 0.141030 0.133659 0.147777 0.159148 0.155890 0.146767 0.159557 0.158214 0.159131 0.158464
qa: -0.0548 -0.0596 -0.2815 -0.4360 -0.3226 -0.0878 0.0868 0.0294 -0.0908 -0.2624 -0.2564 -0.1992 0.3833 0.0349 0.3860 0.0415 -0.2241 -0.2437 -0.2067 0.2741 -0.1529 -0.1755 0.2533 -0.2235 -0.1819 -0.1324 -0.1459 -0.1700 0.0816 0.1008 0.1009 0.0997 0.0939 0.0894 0.1015 0.0989 0.1320 0.1410 0.1337 0.1478 0.1591 0.1559 0.1468 0.1596 0.1582 0.1591 0.1585
va: 1.2704 1.2453 2.1190 2.0800 2.0797 3.1129 3.7561 3.8598 3.8398 3.9073 3.9028 3.8853 4.2058 4.2112 3.7203 3.6733 4.0748 4.0848 3.9621 3.7689 3.9382 3.8994 3.7050 4.0057 3.9294 3.8875 3.8905 3.8961 1.0467 1.0309 1.0001 1.0005 1.0163 1.0052 1.0015 1.0021 1.0158 1.0251 1.0186 1.0114 0.9919 0.9977 1.0066 0.9950 0.9894 0.9903 0.9902
dispcorr: -0.022444227 hartree
energy: -2050.708704486502
dipole: 22.47873 -23.21717 -0.73845 8.21447 -7.82136 0.39311 5.37792 -5.99037 -0.61245
magnitude: 1.03679 au
magnitude: 2.63531 debye
