program: Gaussian 09
title: 000072724
version: EM64L-G09RevD.01
frameworkgroup: C1[X(C15H20O2)]
method: RPBEPBE
basis: SDD
operation: Freq
keyword: #pfreq=noraman
keyword: PBEPBE/SDD
title: #p freq=noraman PBEPBE/SDD
converged: YES YES NO NO
title: Mulliken charges:
elementType: O O C C C C C C C C C C C C C C C H H H H H H H H H H H H H H H H H H H H
charge: -0.232283 -0.206854 0.216288 0.504535 -0.513230 -0.447645 -0.132466 -0.275184 -0.299396 -0.449366 -0.415877 -0.484177 -0.743685 0.373314 -0.721583 0.091225 -0.698902 0.230977 0.211295 0.193173 0.208423 0.244498 0.214015 0.247758 0.210687 0.206550 0.202484 0.203585 0.227796 0.214854 0.204811 0.258531 0.217305 0.216530 0.229196 0.233444 0.259372
chargesum: 0.00000
title: Mulliken charges with hydrogens summed into heavy atoms:
elementType: O O C C C C C C C C C C C C C C C
charge: -0.232283 -0.206854 0.216288 0.504535 -0.070958 -0.046049 0.112033 -0.061170 -0.051638 -0.032129 -0.009808 -0.256381 -0.065489 0.373314 -0.058552 0.091225 -0.206085
polarizability: 1.90679962e+02 -1.89857241e+01 1.54027486e+02 8.45806937e-01 -4.59691157e+00 1.34569444e+02
1716.lowfreq: -18.5744 -2.3890 -0.0004 0.0004 0.0007 8.4942 37.7361 64.6294 94.6710
frequency: 37.4844 64.5844 94.6538 117.5348 147.9309 170.6300 193.8346 232.0367 235.6875 247.6412 265.3015 284.5470 293.7018 332.1522 336.4446 348.0741 404.3157 414.4939 451.2742 482.1528 497.1835 557.6536 595.0534 606.4356 616.6263 636.3514 659.8694 674.5490 739.3217 763.1926 783.4744 809.8156 837.6016 838.6626 853.3697 862.3023 878.9105 917.5335 928.4341 936.7098 954.7491 961.3985 982.2772 984.0857 998.6576 1027.9152 1041.2954 1048.9951 1056.4739 1099.6643 1104.4744 1142.0598 1151.0765 1158.4403 1175.0274 1196.4690 1203.9772 1209.6387 1244.3772 1257.1662 1287.1476 1290.6559 1301.2681 1308.0943 1314.7173 1320.1297 1337.5558 1342.9469 1346.8801 1358.7060 1375.2239 1382.0266 1395.0133 1418.3804 1442.5674 1456.8537 1462.3256 1466.2453 1473.2288 1475.5001 1484.3717 1492.5404 1656.7738 1672.1223 1683.2882 2957.0278 2961.0575 2973.5783 2976.7832 2981.9321 2988.7779 2992.1736 2993.6968 3016.0452 3018.2475 3026.8650 3039.4413 3044.7195 3072.4791 3082.0775 3086.5724 3090.7308 3097.8685 3117.7751 3206.6807
redmass: 4.0437 5.8534 3.4082 2.7908 1.5754 1.7180 2.1531 1.5783 3.3782 3.1806 2.2030 3.3084 2.6787 2.7649 2.8167 2.8907 2.2445 2.4307 3.1616 3.3539 3.4397 3.5316 4.3297 4.8189 2.7042 3.6748 3.3862 2.3973 3.3383 2.7328 2.3816 2.4388 2.2935 3.4856 1.6079 1.6226 2.4046 1.8976 2.3105 2.0879 2.4913 1.8267 1.4417 1.5860 1.6361 2.0850 2.2698 2.4904 1.9906 1.5134 1.7308 2.0706 1.7265 2.5514 1.7251 1.5315 1.9988 1.8590 1.2852 1.9608 1.4391 1.8379 1.4356 1.4508 1.4684 1.6573 1.3931 1.4539 1.5397 1.3958 1.2841 1.2499 1.2671 1.1684 1.0812 1.0763 1.0670 1.0640 1.0641 1.0814 1.0598 1.0626 8.0293 6.8160 11.4771 1.0606 1.0703 1.0625 1.0634 1.0458 1.0624 1.0421 1.0837 1.0869 1.0993 1.0986 1.0982 1.1024 1.0992 1.0967 1.0898 1.0968 1.0617 1.0990 1.1155
irintensity: 2.1393 1.7293 0.9618 0.0535 0.3160 0.2839 0.8427 0.8896 0.2636 0.4803 0.5006 1.7070 0.4750 0.7105 0.7306 1.2092 0.3716 1.8339 1.9966 0.2776 1.5411 1.1374 3.8618 9.4812 2.7736 2.7597 4.5657 7.3246 0.7343 2.3035 8.0716 4.4205 2.0691 28.4445 7.9082 20.1980 10.4102 6.2901 2.2560 2.4401 36.8983 9.4694 47.4677 25.6111 17.0951 81.5998 20.5901 98.7795 3.1836 4.1184 3.5205 4.1652 10.2106 1.4944 7.1897 1.5340 6.6552 26.7123 8.8989 54.2822 4.2435 0.7271 4.7696 4.6841 1.8913 8.7516 2.0606 1.8452 0.1048 0.7267 4.7428 14.7101 10.5854 20.6591 3.7074 2.2979 5.2509 5.6240 23.3662 6.3471 23.4351 6.3094 4.2689 29.0342 240.8854 30.0378 13.9429 25.1704 54.4307 35.9748 25.3574 30.6762 8.1678 73.7018 34.4684 52.6671 22.8625 74.2705 54.4470 31.7154 18.8326 23.3847 4.7083 23.1150 3.0885
temp: 298.150 k
press: 1.00000 atm
elementType: 8 8 6 6 6 6 6 6 6 6 6 6 6 6 6 6 6 1 1 1 1 1 1 1 1 1 1 1 1 1 1 1 1 1 1 1 1
symmnumber: 1
zpe: 827904.6 jmol-1
zpe.correction: 0.315332 hartree
zpe.thermalcorrener: 0.330976 hartree
zpe.thermalcorrenthalpy: 0.331920 hartree
zpe.thermalcorrgfe: 0.273444 hartree
zpe.sumelectzpe: -732.733742 hartree
zpe.sumelectthermal: -732.718098 hartree
zpe.sumelectthermalent: -732.717154 hartree
zpe.sumelectthermalfe: -732.775630 hartree
dipole: 3.2601 1.1428 -4.1084
dipole: 5.3678
quadrupole: -110.6010 -98.0462 -105.0471
quadrupole: -5.7274 13.3752 1.5776
quadrupole: -6.0363 6.5186 -0.4823 -5.7274 13.3752 1.5776
hfenergy: -733.0490739 hartree
pointgroup: C01 [X(C15H20O2)]
dipole: 1.3006597 -0.4773064 1.5938663 debye
polarizability: 190.3814819|19.2333944|154.5171592|-0.8799257|-4.317872|134.3782498 unknown
InChI: InChI=1S/C15H20O2/c1-9-5-4-6-15(3)8-13-11(7-12(9)15)10(2)14(16)17-13/h7,9,11,13H,2,4-6,8H2,1,3H3
charge 0 multiplicity 1
37 atoms
O  -2.008111 1.353847 -0.434286
O  -3.595618 0.152754 -1.646238
C  1.125309 0.959804 -0.004837
C  0.986555 -0.542132 0.310969
C  0.099926 1.774811 0.839668
C  2.55599 1.452621 0.4007
C  -1.319851 1.21778 0.901149
C  2.146225 -1.496277 -0.021831
C  -1.399797 -0.29287 1.260226
C  3.694229 0.557529 -0.131223
C  3.519954 -0.887656 0.383292
C  -0.135264 -1.056809 0.88821
C  0.900601 1.250914 -1.523393
C  -2.592627 -0.766809 0.434752
C  2.142495 -1.964915 -1.506547
C  -2.832912 0.227108 -0.665704
C  -3.353016 -1.878576 0.581518
H  0.066174 2.81926 0.475847
H  0.456009 1.811437 1.890181
H  2.626066 1.47811 1.508517
H  2.683609 2.49525 0.046583
H  -1.932004 1.814808 1.603307
H  1.991076 -2.410221 0.587618
H  -1.600053 -0.4215 2.340909
H  4.66936 0.960741 0.203532
H  3.716076 0.571847 -1.237752
H  4.333729 -1.537029 0.004998
H  3.600155 -0.879799 1.489704
H  -0.177193 -2.13523 1.102257
H  0.884305 2.344466 -1.690539
H  1.707307 0.829343 -2.145574
H  -0.059649 0.8462 -1.878112
H  2.407672 -1.155478 -2.207584
H  2.877927 -2.780091 -1.642539
H  1.146996 -2.346851 -1.795096
H  -3.183763 -2.600331 1.388133
H  -4.168881 -2.07836 -0.122516
