program: Orca
programVersion: 5.0.2
elementType: Cl Cl O O O N C C C C C C C C C C C C C C C C C C C C C C H H H H H H H H H H H H H H H H H H H
charge: 0
multiplicity: 1
keywords: wb97x-d3
keywords: def2-TZVPP
keywords: def2/J RIJCOSX
keywords: DEFGRID2
keywords: scfconv7
keywords: smallprint printgap noloewdin
keywords: NOSOSCF
formula: C22H19Cl2NO3
InChI: InChI=1/C22H19Cl2NO3/c1-22(2)17(12-19(23)24)20(22)21(26)28-18(13-25)14-7-6-10-16(11-14)27-15-8-4-3-5-9-15/h3-12,17-18,20H,1-2H3
47 atoms
Cl -2.235425 -4.096448 -3.112817
Cl -3.685498 -5.883342 -1.370661
O  0.976471 -1.239276 -0.442818
O  1.295267 -1.782081 1.696985
O  1.166058 3.867713 0.115192
N  2.828799 -0.570636 -3.080503
C  -2.017156 -1.250307 0.299552
C  -1.633062 -2.475022 -0.479921
C  -0.854409 -2.103515 0.769564
C  -1.799481 0.094927 -0.349779
C  -3.241099 -1.278335 1.183896
C  -2.440167 -3.701207 -0.451369
C  0.562658 -1.699903 0.744381
C  -2.739967 -4.449628 -1.505305
C  2.324565 -0.794456 -0.52613
C  2.550686 0.527612 0.167771
C  2.590169 -0.675355 -1.961775
C  1.744402 1.615742 -0.142152
C  3.552703 0.642419 1.11913
C  1.954214 2.825239 0.501726
C  3.758344 1.862079 1.747857
C  2.967569 2.958528 1.445725
C  0.776787 4.818253 1.020866
C  0.788082 6.138618 0.595491
C  0.325463 4.4847 2.292141
C  0.34063 7.134546 1.452345
C  -0.106378 5.492574 3.142368
C  -0.101815 6.818393 2.729241
H  -1.131024 -2.270018 -1.417991
H  -1.070504 -2.695442 1.651968
H  -1.026054 0.08885 -1.114036
H  -1.541945 0.851627 0.393648
H  -2.72513 0.412849 -0.833297
H  -3.187257 -0.478405 1.924529
H  -3.358396 -2.215211 1.727229
H  -4.143991 -1.119958 0.591036
H  -2.821684 -4.034903 0.506364
H  3.011411 -1.548822 -0.128707
H  0.959282 1.537986 -0.885742
H  4.17051 -0.211259 1.366478
H  4.544998 1.962404 2.483939
H  3.147099 3.905563 1.938467
H  1.138886 6.382425 -0.399667
H  0.303762 3.453037 2.620996
H  0.347015 8.164064 1.117929
H  -0.455327 5.233905 4.13394
H  -0.443277 7.598532 3.396783
elementType: Cl O N C H
totalener: -2050.68408519 hartree
nucrepener: 2725.00616768 hartree
electener: -4775.69025287 hartree
oneelecener: -8225.13506758 hartree
twoeener: 3449.44481471 hartree
cpcmener: -0.03262131 hartree
kineticenergy: 2044.47129835 hartree
xcener: -151.864212787824 hartree
chargesum: 0.0000000
charge: -0.054815 -0.059484 -0.270421 -0.435194 -0.326593 -0.085742 0.101828 0.054818 -0.105111 -0.286474 -0.265516 -0.221530 0.402700 0.044259 0.362108 0.034460 -0.222612 -0.248005 -0.188901 0.236241 -0.128606 -0.179418 0.281740 -0.244969 -0.188862 -0.122588 -0.147727 -0.181305 0.090776 0.097001 0.091754 0.106114 0.103029 0.100090 0.090657 0.100612 0.129427 0.143935 0.149742 0.145891 0.160506 0.158041 0.146353 0.156597 0.157577 0.159191 0.158426
qa: -0.0548 -0.0595 -0.2704 -0.4352 -0.3266 -0.0857 0.1018 0.0548 -0.1051 -0.2865 -0.2655 -0.2215 0.4027 0.0443 0.3621 0.0345 -0.2226 -0.2480 -0.1889 0.2362 -0.1286 -0.1794 0.2817 -0.2450 -0.1889 -0.1226 -0.1477 -0.1813 0.0908 0.0970 0.0918 0.1061 0.1030 0.1001 0.0907 0.1006 0.1294 0.1439 0.1497 0.1459 0.1605 0.1580 0.1464 0.1566 0.1576 0.1592 0.1584
va: 1.2706 1.2457 2.1311 2.0770 2.0760 3.1093 3.7001 3.8373 3.8760 3.9132 3.9118 3.8875 4.1992 4.2152 3.7873 3.5902 4.0701 4.0445 3.9733 3.8328 3.9030 3.9152 3.6848 4.0115 3.9037 3.8877 3.8937 3.9024 1.0358 1.0301 1.0112 0.9962 1.0022 1.0007 1.0057 1.0015 1.0192 1.0134 1.0105 1.0038 0.9905 0.9949 1.0079 0.9977 0.9893 0.9904 0.9903
dispcorr: -0.024581272 hartree
energy: -2050.708666462746
dipole: 4.28381 -4.95154 -0.66772 36.83550 -35.69788 1.13762 23.74301 -21.41380 2.32921
magnitude: 2.67680 au
magnitude: 6.80388 debye
