program: Orca
programVersion: 5.0.2
elementType: Cl Cl O O O N C C C C C C C C C C C C C C C C C C C C C C H H H H H H H H H H H H H H H H H H H
charge: 0
multiplicity: 1
keywords: wb97x-d3
keywords: def2-TZVPP
keywords: def2/J RIJCOSX
keywords: DEFGRID2
keywords: scfconv7
keywords: smallprint printgap noloewdin
keywords: NOSOSCF
formula: C22H19Cl2NO3
InChI: InChI=1/C22H19Cl2NO3/c1-22(2)17(12-19(23)24)20(22)21(26)28-18(13-25)14-7-6-10-16(11-14)27-15-8-4-3-5-9-15/h3-12,17-18,20H,1-2H3
47 atoms
Cl -3.546168 0.581416 -0.900212
Cl -4.092138 -0.72543 -3.409156
O  1.873786 -2.084495 -0.000351
O  0.460072 -1.117898 1.438917
O  1.998937 3.453419 0.659621
N  5.103305 -2.756969 0.118397
C  -1.521129 -3.295737 0.352215
C  -1.79299 -1.964343 -0.27982
C  -0.381886 -2.534024 -0.296614
C  -1.626174 -3.398476 1.854038
C  -1.943057 -4.56332 -0.352631
C  -2.512121 -1.827608 -1.550641
C  0.648234 -1.83348 0.4884
C  -3.2716 -0.796039 -1.896488
C  2.956017 -1.338786 0.559423
C  3.025389 0.024372 -0.082249
C  4.153684 -2.137586 0.299167
C  2.553764 1.116912 0.629208
C  3.453292 0.17073 -1.397643
C  2.472326 2.354572 0.004663
C  3.407665 1.421301 -1.991801
C  2.904554 2.515282 -1.30238
C  0.88111 3.34026 1.444028
C  -0.199022 2.538709 1.090692
C  0.846252 4.10669 2.600305
C  -1.311969 2.504176 1.918143
C  -0.279756 4.070632 3.410144
C  -1.359955 3.265192 3.07831
H  -1.933713 -1.153418 0.426095
H  -0.034273 -2.941649 -1.239147
H  -0.9162 -4.129735 2.24401
H  -2.626404 -3.738973 2.123209
H  -1.456315 -2.455815 2.367224
H  -3.009578 -4.74495 -0.206236
H  -1.402342 -5.417455 0.058797
H  -1.749589 -4.546899 -1.424457
H  -2.419217 -2.62466 -2.278745
H  2.856314 -1.248954 1.645252
H  2.235422 0.99815 1.657029
H  3.822407 -0.678205 -1.960308
H  3.748396 1.54559 -3.010921
H  2.846228 3.486865 -1.77685
H  -0.186847 1.949115 0.182263
H  1.694096 4.727763 2.861254
H  -2.150728 1.87641 1.647414
H  -0.304848 4.670351 4.310871
H  -2.233064 3.231488 3.716353
elementType: Cl O N C H
totalener: -2050.68555739 hartree
nucrepener: 2837.95649295 hartree
electener: -4888.64205035 hartree
oneelecener: -8451.26794076 hartree
twoeener: 3562.62589041 hartree
cpcmener: -0.02992673 hartree
kineticenergy: 2044.48163613 hartree
xcener: -151.865400885411 hartree
chargesum: 0.0000000
charge: -0.061272 -0.059875 -0.276318 -0.451622 -0.330075 -0.087587 0.084671 0.020391 -0.055596 -0.264955 -0.274067 -0.194789 0.398486 0.050699 0.404483 0.003220 -0.220903 -0.173190 -0.211255 0.257157 -0.125796 -0.217850 0.287281 -0.188992 -0.249085 -0.124506 -0.119404 -0.197430 0.075331 0.097127 0.100368 0.097967 0.094818 0.103305 0.098614 0.093144 0.127888 0.134609 0.145677 0.143328 0.159881 0.148245 0.146948 0.145883 0.150812 0.156789 0.157447
qa: -0.0613 -0.0599 -0.2763 -0.4516 -0.3301 -0.0876 0.0847 0.0204 -0.0556 -0.2650 -0.2741 -0.1948 0.3985 0.0507 0.4045 0.0032 -0.2209 -0.1732 -0.2113 0.2572 -0.1258 -0.2179 0.2873 -0.1890 -0.2491 -0.1245 -0.1194 -0.1974 0.0753 0.0971 0.1004 0.0980 0.0948 0.1033 0.0986 0.0931 0.1279 0.1346 0.1457 0.1433 0.1599 0.1482 0.1469 0.1459 0.1508 0.1568 0.1574
va: 1.2741 1.2451 2.1382 2.0478 2.0825 3.1100 3.7547 3.8860 3.8092 3.9022 3.9131 3.8927 4.1767 4.1972 3.7388 3.6258 4.0556 3.9191 3.9942 3.7496 3.9085 4.0284 3.7162 3.8764 4.0065 3.8737 3.8880 3.9527 1.0347 1.0312 0.9992 0.9999 1.0188 0.9996 1.0013 1.0053 1.0206 1.0194 1.0161 1.0086 0.9894 1.0042 1.0050 1.0080 0.9933 0.9890 0.9913
dispcorr: -0.025599867 hartree
energy: -2050.711157258975
dipole: 7.31922 -8.57453 -1.25531 -10.09930 9.48716 -0.61214 16.57008 -16.62877 -0.05869
magnitude: 1.39784 au
magnitude: 3.55303 debye
