program: Orca
programVersion: 5.0.2
elementType: Cl Cl O O O N C C C C C C C C C C C C C C C C C C C C C C H H H H H H H H H H H H H H H H H H H
charge: 0
multiplicity: 1
keywords: wb97x-d3
keywords: def2-TZVPP
keywords: def2/J RIJCOSX
keywords: DEFGRID2
keywords: scfconv7
keywords: smallprint printgap noloewdin
keywords: NOSOSCF
formula: C22H19Cl2NO3
InChI: InChI=1/C22H19Cl2NO3/c1-22(2)17(12-19(23)24)20(22)21(26)28-18(13-25)14-7-6-10-16(11-14)27-15-8-4-3-5-9-15/h3-12,17-18,20H,1-2H3
47 atoms
Cl -1.709552 -2.28528 -3.935898
Cl -3.646472 -4.343565 -3.356593
O  0.941339 -1.09902 0.230251
O  0.769707 -2.525952 1.936934
O  2.034651 4.136387 1.198905
N  3.982606 -2.473516 -0.199905
C  -2.111797 -1.003514 0.327161
C  -1.64301 -1.869158 -0.80775
C  -1.142765 -2.138521 0.601348
C  -1.660207 0.437828 0.353695
C  -3.503138 -1.182876 0.886987
C  -2.511398 -2.877941 -1.427623
C  0.263351 -1.960401 1.002209
C  -2.601959 -3.126231 -2.727936
C  2.245752 -0.71456 0.651231
C  2.49849 0.668481 0.109425
C  3.216301 -1.701919 0.16898
C  2.169718 1.743268 0.926651
C  2.968378 0.877548 -1.180111
C  2.305923 3.036982 0.441693
C  3.11838 2.176685 -1.643344
C  2.784518 3.25739 -0.843662
C  1.031125 4.094595 2.13279
C  -0.241332 3.639731 1.809526
C  1.311635 4.580562 3.400823
C  -1.235576 3.669143 2.776274
C  0.303607 4.615255 4.354801
C  -0.969574 4.155351 4.049856
H  -0.930852 -1.394296 -1.472028
H  -1.585456 -2.991959 1.102531
H  -1.494599 0.774936 1.378927
H  -2.442601 1.067265 -0.075298
H  -0.75353 0.620964 -0.216921
H  -3.799758 -2.226548 0.982459
H  -4.236381 -0.682524 0.251528
H  -3.56737 -0.735692 1.880453
H  -3.127734 -3.48428 -0.774455
H  2.31421 -0.701171 1.742663
H  1.813267 1.562554 1.933972
H  3.22035 0.044088 -1.823821
H  3.489775 2.350884 -2.644466
H  2.89733 4.269958 -1.21001
H  -0.461098 3.272591 0.814324
H  2.307844 4.933454 3.636781
H  -2.227961 3.316542 2.5260
H  0.521127 4.997725 5.343749
H  -1.751365 4.178577 4.797635
elementType: Cl O N C H
totalener: -2050.68439188 hartree
nucrepener: 2778.50878705 hartree
electener: -4829.19317893 hartree
oneelecener: -8331.37156436 hartree
twoeener: 3502.17838543 hartree
cpcmener: -0.03326694 hartree
kineticenergy: 2044.46908170 hartree
xcener: -151.862578777544 hartree
chargesum: 0.0000000
charge: -0.054937 -0.059208 -0.266719 -0.440037 -0.328303 -0.082781 0.114087 0.055186 -0.092200 -0.294715 -0.269659 -0.225598 0.407247 0.046049 0.384560 -0.010888 -0.227514 -0.205051 -0.196092 0.283484 -0.121088 -0.225391 0.271353 -0.201105 -0.232774 -0.150569 -0.126733 -0.177215 0.089461 0.095774 0.103024 0.103693 0.092698 0.092173 0.101637 0.099811 0.128457 0.127584 0.143886 0.141771 0.159620 0.147936 0.174387 0.146747 0.161158 0.158371 0.158424
qa: -0.0549 -0.0592 -0.2667 -0.4400 -0.3283 -0.0828 0.1141 0.0552 -0.0922 -0.2947 -0.2697 -0.2256 0.4072 0.0460 0.3846 -0.0109 -0.2275 -0.2051 -0.1961 0.2835 -0.1211 -0.2254 0.2714 -0.2011 -0.2328 -0.1506 -0.1267 -0.1772 0.0895 0.0958 0.1030 0.1037 0.0927 0.0922 0.1016 0.0998 0.1285 0.1276 0.1439 0.1418 0.1596 0.1479 0.1744 0.1467 0.1612 0.1584 0.1584
va: 1.2708 1.2458 2.1303 2.0691 2.0831 3.1118 3.7225 3.8375 3.8828 3.9143 3.9101 3.8935 4.1773 4.2165 3.7432 3.7203 4.0505 3.9024 3.9733 3.7205 3.9239 4.0188 3.7058 3.9121 4.0095 3.8879 3.8869 3.9118 1.0375 1.0306 0.9971 0.9989 1.0083 1.0064 1.0006 1.0005 1.0199 1.0247 1.0065 1.0102 0.9894 1.0058 0.9823 1.0067 0.9899 0.9889 0.9902
dispcorr: -0.025698977 hartree
energy: -2050.710090856510
dipole: -1.76522 -0.23773 -2.00294 26.78385 -24.52394 2.25992 27.05654 -26.18803 0.86851
magnitude: 3.14218 au
magnitude: 7.98679 debye
