program: Orca
programVersion: 5.0.2
elementType: Cl Cl O O O N C C C C C C C C C C C C C C C C C C C C C C H H H H H H H H H H H H H H H H H H H
charge: 0
multiplicity: 1
keywords: wb97x-d3
keywords: def2-TZVPP
keywords: def2/J RIJCOSX
keywords: DEFGRID2
keywords: scfconv7
keywords: smallprint printgap noloewdin
keywords: NOSOSCF
formula: C22H19Cl2NO3
InChI: InChI=1/C22H19Cl2NO3/c1-22(2)17(12-19(23)24)20(22)21(26)28-18(13-25)14-7-6-10-16(11-14)27-15-8-4-3-5-9-15/h3-12,17-18,20H,1-2H3
47 atoms
Cl -3.55914 0.593579 -0.868115
Cl -4.097471 -0.696228 -3.387641
O  1.873944 -2.06899 -0.016146
O  0.474779 -1.130931 1.456393
O  1.968472 3.450596 0.626076
N  5.104808 -2.765684 0.112173
C  -1.525146 -3.281065 0.361193
C  -1.79119 -1.94737 -0.268216
C  -0.383163 -2.525215 -0.288779
C  -1.629847 -3.384566 1.863048
C  -1.954764 -4.545189 -0.34465
C  -2.511363 -1.804083 -1.537711
C  0.653788 -1.830955 0.492991
C  -3.276482 -0.773893 -1.875629
C  2.964578 -1.334153 0.543561
C  3.043815 0.030311 -0.094095
C  4.155696 -2.143183 0.284522
C  2.544411 1.117249 0.607879
C  3.507187 0.184294 -1.396531
C  2.467933 2.35576 -0.015346
C  3.467828 1.436653 -1.987777
C  2.935402 2.523764 -1.309958
C  0.85916 3.323696 1.420884
C  -0.209631 2.499944 1.083453
C  0.819853 4.100682 2.569797
C  -1.314194 2.451615 1.921458
C  -0.298552 4.051313 3.389598
C  -1.3659 3.222102 3.075091
H  -1.926308 -1.137461 0.439432
H  -0.041118 -2.932448 -1.233143
H  -1.455422 -2.442197 2.376539
H  -0.922471 -4.119481 2.251672
H  -2.632718 -3.720565 2.132284
H  -3.020693 -4.724581 -0.192278
H  -1.41349 -5.401767 0.060671
H  -1.767956 -4.525369 -1.417711
H  -2.414315 -2.595086 -2.27164
H  2.865722 -1.246132 1.629586
H  2.202353 0.992414 1.627229
H  3.899291 -0.659909 -1.950634
H  3.8367 1.566945 -2.996487
H  2.882385 3.496286 -1.782916
H  -0.193822 1.90302 0.180023
H  1.65783 4.740421 2.817125
H  -2.143961 1.806211 1.664655
H  -0.327708 4.659491 4.284431
H  -2.232353 3.176955 3.721463
elementType: Cl O N C H
totalener: -2050.68553237 hartree
nucrepener: 2839.63722380 hartree
electener: -4890.32275617 hartree
oneelecener: -8454.60198080 hartree
twoeener: 3564.27922462 hartree
cpcmener: -0.02973489 hartree
kineticenergy: 2044.47584452 hartree
xcener: -151.864572935261 hartree
chargesum: 0.0000000
charge: -0.061202 -0.059770 -0.276922 -0.451404 -0.328994 -0.087551 0.084283 0.021061 -0.055375 -0.265424 -0.273135 -0.194186 0.399018 0.050309 0.403324 0.001806 -0.219671 -0.177972 -0.211751 0.265222 -0.123591 -0.222635 0.293071 -0.194541 -0.251826 -0.120168 -0.117836 -0.199530 0.074807 0.096810 0.095042 0.100382 0.097742 0.102952 0.098752 0.092882 0.127878 0.134286 0.145968 0.142593 0.159871 0.148115 0.147734 0.145783 0.149599 0.156817 0.157376
qa: -0.0612 -0.0598 -0.2769 -0.4514 -0.3290 -0.0876 0.0843 0.0211 -0.0554 -0.2654 -0.2731 -0.1942 0.3990 0.0503 0.4033 0.0018 -0.2197 -0.1780 -0.2118 0.2652 -0.1236 -0.2226 0.2931 -0.1945 -0.2518 -0.1202 -0.1178 -0.1995 0.0748 0.0968 0.0950 0.1004 0.0977 0.1030 0.0988 0.0929 0.1279 0.1343 0.1460 0.1426 0.1599 0.1481 0.1477 0.1458 0.1496 0.1568 0.1574
va: 1.2743 1.2452 2.1367 2.0475 2.0855 3.1100 3.7533 3.8889 3.8109 3.9012 3.9131 3.8926 4.1745 4.1964 3.7376 3.6399 4.0553 3.9161 3.9962 3.7464 3.9081 4.0296 3.7143 3.8810 4.0096 3.8695 3.8861 3.9591 1.0327 1.0314 1.0189 0.9992 0.9999 0.9998 1.0013 1.0054 1.0205 1.0198 1.0165 1.0087 0.9894 1.0045 1.0043 1.0081 0.9944 0.9890 0.9915
dispcorr: -0.025676101 hartree
energy: -2050.711208467606
dipole: 7.41578 -8.66286 -1.24708 -10.16999 9.58544 -0.58456 16.48419 -16.54456 -0.06037
magnitude: 1.37861 au
magnitude: 3.50414 debye
