program: Orca
programVersion: 5.0.2
elementType: Cl Cl O O O N C C C C C C C C C C C C C C C C C C C C C C H H H H H H H H H H H H H H H H H H H
charge: 0
multiplicity: 1
keywords: wb97x-d3
keywords: def2-TZVPP
keywords: def2/J RIJCOSX
keywords: DEFGRID2
keywords: scfconv7
keywords: smallprint printgap noloewdin
keywords: NOSOSCF
formula: C22H19Cl2NO3
InChI: InChI=1/C22H19Cl2NO3/c1-22(2)17(12-19(23)24)20(22)21(26)28-18(13-25)14-7-6-10-16(11-14)27-15-8-4-3-5-9-15/h3-12,17-18,20H,1-2H3
47 atoms
Cl -3.681699 -0.060281 -1.92849
Cl -3.764565 -2.02892 -4.035139
O  1.723582 -1.98059 0.181441
O  0.171674 -0.806434 1.28016
O  2.087066 3.766747 0.668558
N  4.986051 -2.35204 0.271107
C  -1.668807 -3.246073 0.598963
C  -1.882886 -2.169536 -0.421696
C  -0.471328 -2.649432 -0.111863
C  -1.958067 -2.912935 2.042024
C  -1.981478 -4.682801 0.256628
C  -2.426249 -2.44381 -1.756442
C  0.457358 -1.710487 0.538034
C  -3.188037 -1.619436 -2.464442
C  2.730143 -1.097783 0.671653
C  2.703414 0.230329 -0.046024
C  3.989322 -1.807728 0.441801
C  2.438059 1.380838 0.680397
C  2.887402 0.285952 -1.423054
C  2.328373 2.595467 0.015767
C  2.79968 1.508948 -2.068505
C  2.510199 2.664257 -1.358108
C  1.246094 3.814437 1.747235
C  0.084847 3.054552 1.829463
C  1.574419 4.717191 2.749238
C  -0.737702 3.198056 2.938145
C  0.735023 4.858558 3.844401
C  -0.420163 4.095861 3.948294
H  -2.124452 -1.198243 -0.00515
H  -0.01342 -3.29185 -0.855258
H  -1.288151 -3.459214 2.708699
H  -2.978726 -3.214529 2.283811
H  -1.870653 -1.853234 2.268362
H  -3.053625 -4.870251 0.339717
H  -1.473847 -5.352112 0.953265
H  -1.668813 -4.966253 -0.747649
H  -2.178554 -3.391377 -2.219351
H  2.631381 -0.949771 1.751743
H  2.307684 1.321338 1.75378
H  3.096768 -0.611703 -1.992064
H  2.945064 1.565549 -3.139128
H  2.427817 3.616976 -1.866011
H  -0.185275 2.357537 1.046021
H  2.478689 5.307284 2.666492
H  -1.639395 2.602972 3.005163
H  0.9930 5.565976 4.621961
H  -1.069381 4.202063 4.807329
elementType: Cl O N C H
totalener: -2050.68599925 hartree
nucrepener: 2772.08972730 hartree
electener: -4822.77572655 hartree
oneelecener: -8319.61091375 hartree
twoeener: 3496.83518720 hartree
cpcmener: -0.03033653 hartree
kineticenergy: 2044.47606131 hartree
xcener: -151.864530618764 hartree
chargesum: -0.0000000
charge: -0.054765 -0.059392 -0.276027 -0.449298 -0.325976 -0.087993 0.093748 0.020497 -0.070811 -0.269244 -0.270102 -0.200817 0.398011 0.041823 0.401766 0.017071 -0.222960 -0.196999 -0.225518 0.288501 -0.121310 -0.230039 0.302973 -0.201737 -0.260423 -0.137762 -0.114377 -0.191802 0.086217 0.097018 0.100358 0.097137 0.095990 0.102228 0.098708 0.091774 0.128193 0.136356 0.145553 0.146111 0.159317 0.147448 0.151197 0.145357 0.158496 0.157693 0.157811
qa: -0.0548 -0.0594 -0.2760 -0.4493 -0.3260 -0.0880 0.0937 0.0205 -0.0708 -0.2692 -0.2701 -0.2008 0.3980 0.0418 0.4018 0.0171 -0.2230 -0.1970 -0.2255 0.2885 -0.1213 -0.2300 0.3030 -0.2017 -0.2604 -0.1378 -0.1144 -0.1918 0.0862 0.0970 0.1004 0.0971 0.0960 0.1022 0.0987 0.0918 0.1282 0.1364 0.1456 0.1461 0.1593 0.1474 0.1512 0.1454 0.1585 0.1577 0.1578
va: 1.2708 1.2455 2.1406 2.0595 2.0896 3.1111 3.7304 3.8801 3.8415 3.9040 3.9109 3.9029 4.1663 4.2149 3.7492 3.5806 4.0632 3.9309 3.9896 3.7330 3.9064 4.0194 3.6838 3.9073 4.0133 3.8890 3.8801 3.9135 1.0404 1.0324 0.9993 1.0002 1.0187 1.0003 1.0012 1.0057 1.0201 1.0165 1.0087 1.0093 0.9894 1.0056 1.0058 1.0089 0.9907 0.9889 0.9905
dispcorr: -0.023843233 hartree
energy: -2050.709842486873
dipole: 7.28967 -8.55454 -1.26486 -3.36204 2.73675 -0.62529 24.49299 -23.98164 0.51135
magnitude: 1.50078 au
magnitude: 3.81468 debye
