program: Orca
programVersion: 5.0.2
elementType: Cl Cl O O O N C C C C C C C C C C C C C C C C C C C C C C H H H H H H H H H H H H H H H H H H H
charge: 0
multiplicity: 1
keywords: wb97x-d3
keywords: def2-TZVPP
keywords: def2/J RIJCOSX
keywords: DEFGRID2
keywords: scfconv7
keywords: smallprint printgap noloewdin
keywords: NOSOSCF
formula: C22H19Cl2NO3
InChI: InChI=1/C22H19Cl2NO3/c1-22(2)17(12-19(23)24)20(22)21(26)28-18(13-25)14-7-6-10-16(11-14)27-15-8-4-3-5-9-15/h3-12,17-18,20H,1-2H3
47 atoms
Cl -1.282268 -0.656883 -2.462145
Cl -3.16392 -2.270987 -3.953398
O  1.496638 -1.95077 0.31684
O  -0.001697 -0.791655 1.502517
O  1.499399 3.852117 0.414752
N  4.774204 -1.981021 -0.087518
C  -1.861452 -3.278756 1.040082
C  -2.112773 -2.267985 -0.020569
C  -0.686149 -2.719596 0.253421
C  -2.087552 -2.887142 2.479194
C  -2.179392 -4.727129 0.757486
C  -2.728538 -2.59692 -1.323435
C  0.254811 -1.720768 0.780212
C  -2.440533 -1.928377 -2.432054
C  2.471912 -0.950843 0.591868
C  2.199531 0.313772 -0.18798
C  3.751909 -1.545496 0.202501
C  2.01986 1.503405 0.498726
C  2.069098 0.264579 -1.571344
C  1.677769 2.650647 -0.205416
C  1.748308 1.422369 -2.262091
C  1.538843 2.615096 -1.584969
C  0.859482 3.914063 1.623913
C  1.323156 4.856859 2.530671
C  -0.240088 3.118986 1.927396
C  0.679169 5.005567 3.750499
C  -0.865562 3.271111 3.156479
C  -0.412078 4.210358 4.072828
H  -2.330746 -1.26552 0.33923
H  -0.257474 -3.400437 -0.472959
H  -1.394745 -3.409986 3.140786
H  -3.099976 -3.167882 2.775526
H  -1.982766 -1.819299 2.655126
H  -1.606501 -5.378673 1.41941
H  -1.949776 -5.019048 -0.267906
H  -3.238301 -4.927784 0.932593
H  -3.459218 -3.395672 -1.380746
H  2.526478 -0.734418 1.663657
H  2.130018 1.525758 1.576043
H  2.211727 -0.664473 -2.109415
H  1.643745 1.396047 -3.338671
H  1.269145 3.514721 -2.123753
H  2.178272 5.47212 2.279352
H  -0.61284 2.387613 1.220904
H  1.04131 5.743674 4.454661
H  -1.719293 2.649121 3.393202
H  -0.907486 4.323193 5.028162
elementType: Cl O N C H
totalener: -2050.68369877 hartree
nucrepener: 2856.58691178 hartree
electener: -4907.27061055 hartree
oneelecener: -8488.91263419 hartree
twoeener: 3581.64202364 hartree
cpcmener: -0.02982223 hartree
kineticenergy: 2044.47855408 hartree
xcener: -151.864725729439 hartree
chargesum: 0.0000000
charge: -0.052738 -0.054423 -0.273799 -0.444843 -0.328895 -0.087672 0.143702 -0.062513 -0.089915 -0.271760 -0.282546 -0.205708 0.366223 0.074757 0.412627 0.060953 -0.226606 -0.196374 -0.280303 0.273693 -0.125761 -0.210979 0.287488 -0.250846 -0.184132 -0.120314 -0.145984 -0.186243 0.120843 0.105690 0.101329 0.095154 0.095113 0.099246 0.092941 0.102952 0.140439 0.136372 0.144859 0.149143 0.162005 0.149148 0.145506 0.148870 0.157032 0.158654 0.157616
qa: -0.0527 -0.0544 -0.2738 -0.4448 -0.3289 -0.0877 0.1437 -0.0625 -0.0899 -0.2718 -0.2825 -0.2057 0.3662 0.0748 0.4126 0.0610 -0.2266 -0.1964 -0.2803 0.2737 -0.1258 -0.2110 0.2875 -0.2508 -0.1841 -0.1203 -0.1460 -0.1862 0.1208 0.1057 0.1013 0.0952 0.0951 0.0992 0.0929 0.1030 0.1404 0.1364 0.1449 0.1491 0.1620 0.1491 0.1455 0.1489 0.1570 0.1587 0.1576
va: 1.2936 1.2526 2.1304 2.0583 2.0833 3.1123 3.7263 3.8988 3.8257 3.8864 3.9142 3.8954 4.1732 4.1908 3.7353 3.5146 4.0712 3.9435 3.9467 3.7391 3.8484 4.0088 3.6926 4.0078 3.8941 3.8850 3.8951 3.9071 1.0181 1.0270 0.9992 1.0011 1.0184 1.0029 0.9995 0.9987 1.0078 1.0170 1.0073 1.0144 0.9889 1.0035 1.0081 1.0076 0.9892 0.9908 0.9904
dispcorr: -0.026509768 hartree
energy: -2050.710208535759
dipole: -3.19649 1.12563 -2.07086 -1.21055 0.56275 -0.64780 28.61001 -27.74582 0.86419
magnitude: 2.33558 au
magnitude: 5.93656 debye
