program: Orca
programVersion: 5.0.2
elementType: Cl Cl O O O N C C C C C C C C C C C C C C C C C C C C C C H H H H H H H H H H H H H H H H H H H
charge: 0
multiplicity: 1
keywords: wb97x-d3
keywords: def2-TZVPP
keywords: def2/J RIJCOSX
keywords: DEFGRID2
keywords: scfconv7
keywords: smallprint printgap noloewdin
keywords: NOSOSCF
formula: C22H19Cl2NO3
InChI: InChI=1/C22H19Cl2NO3/c1-22(2)17(12-19(23)24)20(22)21(26)28-18(13-25)14-7-6-10-16(11-14)27-15-8-4-3-5-9-15/h3-12,17-18,20H,1-2H3
47 atoms
Cl -1.295933 -0.510098 -2.51072
Cl -3.159363 -2.051482 -4.098212
O  1.434896 -1.99827 0.290825
O  -0.06963 -0.865982 1.494287
O  1.584772 3.810597 0.57433
N  4.718668 -2.052745 -0.064719
C  -1.967515 -3.28746 0.873826
C  -2.168074 -2.231068 -0.152821
C  -0.758855 -2.723232 0.143848
C  -2.233032 -2.948577 2.319391
C  -2.302311 -4.717065 0.52418
C  -2.759565 -2.497423 -1.480905
C  0.186844 -1.766421 0.736592
C  -2.454592 -1.779865 -2.553431
C  2.418083 -1.024236 0.623632
C  2.181446 0.269529 -0.119656
C  3.697812 -1.621152 0.236287
C  2.029987 1.44393 0.59949
C  2.059971 0.262741 -1.504813
C  1.728472 2.620199 -0.075012
C  1.777227 1.447773 -2.164903
C  1.598569 2.626851 -1.456036
C  0.95289 3.863381 1.788151
C  -0.17726 3.105533 2.073028
C  1.456848 4.760868 2.718852
C  -0.794032 3.249848 3.307397
C  0.821603 4.902676 3.944102
C  -0.301291 4.145154 4.247205
H  -2.375226 -1.239039 0.240646
H  -0.322862 -3.384292 -0.596139
H  -1.584656 -3.523773 2.982587
H  -3.265209 -3.204884 2.565883
H  -2.098152 -1.893689 2.545885
H  -1.753805 -5.404336 1.170383
H  -2.053919 -4.970042 -0.507082
H  -3.367581 -4.907942 0.668058
H  -3.4897 -3.291371 -1.587393
H  2.452653 -0.846006 1.703217
H  2.133042 1.432715 1.677699
H  2.18058 -0.654578 -2.067716
H  1.679127 1.454364 -3.24241
H  1.36023 3.548931 -1.971148
H  -0.579377 2.408416 1.348182
H  2.336318 5.346583 2.48182
H  -1.67237 2.65765 3.529715
H  1.215097 5.605495 4.667206
H  -0.790434 4.25273 5.206341
elementType: Cl O N C H
totalener: -2050.68377770 hartree
nucrepener: 2851.74447140 hartree
electener: -4902.42824910 hartree
oneelecener: -8479.21106322 hartree
twoeener: 3576.78281412 hartree
cpcmener: -0.02985587 hartree
kineticenergy: 2044.47937899 hartree
xcener: -151.864833069349 hartree
chargesum: -0.0000000
charge: -0.051966 -0.054586 -0.274938 -0.444667 -0.328730 -0.087699 0.144751 -0.066495 -0.087498 -0.270824 -0.283352 -0.200575 0.367039 0.071214 0.412977 0.058165 -0.226750 -0.196234 -0.275488 0.273924 -0.130507 -0.209673 0.287099 -0.184959 -0.250975 -0.145000 -0.120507 -0.185679 0.120858 0.104843 0.100255 0.095399 0.095305 0.099581 0.092838 0.102879 0.139848 0.136420 0.145193 0.148502 0.162280 0.149188 0.149929 0.145356 0.158474 0.157230 0.157552
qa: -0.0520 -0.0546 -0.2749 -0.4447 -0.3287 -0.0877 0.1448 -0.0665 -0.0875 -0.2708 -0.2834 -0.2006 0.3670 0.0712 0.4130 0.0582 -0.2268 -0.1962 -0.2755 0.2739 -0.1305 -0.2097 0.2871 -0.1850 -0.2510 -0.1450 -0.1205 -0.1857 0.1209 0.1048 0.1003 0.0954 0.0953 0.0996 0.0928 0.1029 0.1398 0.1364 0.1452 0.1485 0.1623 0.1492 0.1499 0.1454 0.1585 0.1572 0.1576
va: 1.2937 1.2522 2.1292 2.0589 2.0828 3.1117 3.7279 3.9047 3.8258 3.8845 3.9145 3.8890 4.1736 4.1939 3.7346 3.5222 4.0731 3.9435 3.9447 3.7395 3.8497 4.0070 3.6922 3.8970 4.0086 3.8944 3.8842 3.9069 1.0182 1.0271 0.9995 1.0011 1.0187 1.0028 0.9993 0.9989 1.0079 1.0176 1.0070 1.0150 0.9891 1.0035 1.0065 1.0082 0.9907 0.9892 0.9904
dispcorr: -0.026391059 hartree
energy: -2050.710168760520
dipole: -3.51975 1.43440 -2.08535 -2.26050 1.61934 -0.64116 28.46240 -27.64913 0.81327
magnitude: 2.32834 au
magnitude: 5.91817 debye
