program: Orca
programVersion: 5.0.2
elementType: Cl Cl O O O N C C C C C C C C C C C C C C C C C C C C C C H H H H H H H H H H H H H H H H H H H
charge: 0
multiplicity: 1
keywords: wb97x-d3
keywords: def2-TZVPP
keywords: def2/J RIJCOSX
keywords: DEFGRID2
keywords: scfconv7
keywords: smallprint printgap noloewdin
keywords: NOSOSCF
formula: C22H19Cl2NO3
InChI: InChI=1/C22H19Cl2NO3/c1-22(2)17(12-19(23)24)20(22)21(26)28-18(13-25)14-7-6-10-16(11-14)27-15-8-4-3-5-9-15/h3-12,17-18,20H,1-2H3
47 atoms
Cl -1.362481 -0.562697 -2.573609
Cl -3.111057 -2.242107 -4.152409
O  1.41094 -1.981032 0.280108
O  -0.107863 -0.844943 1.461726
O  1.635133 3.849862 0.596366
N  4.688871 -2.013469 -0.094076
C  -1.987732 -3.286563 0.883166
C  -2.177383 -2.275445 -0.190354
C  -0.769662 -2.743683 0.154077
C  -2.285362 -2.887458 2.307087
C  -2.304203 -4.733303 0.59115
C  -2.733688 -2.602432 -1.519326
C  0.160461 -1.757849 0.723685
C  -2.445709 -1.897194 -2.604366
C  2.386855 -0.999641 0.610004
C  2.141711 0.299051 -0.122432
C  3.668319 -1.58521 0.211687
C  2.033819 1.474099 0.603432
C  1.981692 0.298344 -1.503583
C  1.736962 2.65821 -0.059308
C  1.704281 1.490734 -2.152482
C  1.569467 2.671328 -1.436269
C  1.028499 3.915884 1.822177
C  -0.093488 3.159891 2.141928
C  1.551188 4.825572 2.730819
C  -0.680376 3.315642 3.389485
C  0.944786 4.979358 3.969103
C  -0.168047 4.222037 4.307752
H  -2.399883 -1.270226 0.158195
H  -0.316595 -3.430018 -0.551877
H  -2.187692 -1.819018 2.482801
H  -1.629865 -3.408609 3.006788
H  -3.312625 -3.164971 2.550841
H  -1.771526 -5.385287 1.285362
H  -2.023888 -5.034104 -0.418833
H  -3.372137 -4.924654 0.712881
H  -3.418331 -3.436423 -1.618655
H  2.427068 -0.827953 1.69047
H  2.166891 1.457587 1.678339
H  2.069014 -0.619514 -2.071582
H  1.576602 1.502513 -3.226845
H  1.336597 3.599627 -1.942573
H  -0.511891 2.454098 1.435122
H  2.423338 5.410714 2.46694
H  -1.551384 2.723522 3.639044
H  1.353575 5.691296 4.674578
H  -0.633615 4.33818 5.277543
elementType: Cl O N C H
totalener: -2050.68371660 hartree
nucrepener: 2841.84232982 hartree
electener: -4892.52604642 hartree
oneelecener: -8459.38169236 hartree
twoeener: 3566.85564594 hartree
cpcmener: -0.02998121 hartree
kineticenergy: 2044.48209466 hartree
xcener: -151.865322376933 hartree
chargesum: 0.0000000
charge: -0.051927 -0.054864 -0.275201 -0.443534 -0.328437 -0.087104 0.143955 -0.071756 -0.080234 -0.271216 -0.284040 -0.193564 0.364981 0.067177 0.411450 0.055663 -0.227036 -0.200673 -0.272599 0.276995 -0.124960 -0.213233 0.292225 -0.189337 -0.254182 -0.143631 -0.118772 -0.188390 0.120700 0.103759 0.095082 0.101344 0.095225 0.099728 0.092246 0.103023 0.139713 0.137051 0.145370 0.148648 0.161833 0.149073 0.150320 0.145133 0.159000 0.157372 0.157625
qa: -0.0519 -0.0549 -0.2752 -0.4435 -0.3284 -0.0871 0.1440 -0.0718 -0.0802 -0.2712 -0.2840 -0.1936 0.3650 0.0672 0.4114 0.0557 -0.2270 -0.2007 -0.2726 0.2770 -0.1250 -0.2132 0.2922 -0.1893 -0.2542 -0.1436 -0.1188 -0.1884 0.1207 0.1038 0.0951 0.1013 0.0952 0.0997 0.0922 0.1030 0.1397 0.1371 0.1454 0.1486 0.1618 0.1491 0.1503 0.1451 0.1590 0.1574 0.1576
va: 1.2926 1.2518 2.1286 2.0611 2.0836 3.1120 3.7347 3.9109 3.8194 3.8835 3.9157 3.8791 4.1740 4.1960 3.7344 3.5307 4.0747 3.9483 3.9487 3.7357 3.8548 4.0108 3.6904 3.8965 4.0093 3.8932 3.8831 3.9095 1.0183 1.0277 1.0188 0.9994 1.0011 1.0026 0.9997 0.9987 1.0083 1.0174 1.0060 1.0159 0.9893 1.0037 1.0061 1.0084 0.9905 0.9890 0.9905
dispcorr: -0.026181425 hartree
energy: -2050.709898025665
dipole: -3.36963 1.30517 -2.06445 -1.45244 0.79138 -0.66106 29.06967 -28.21270 0.85697
magnitude: 2.33096 au
magnitude: 5.92483 debye
