program: Orca
programVersion: 5.0.2
elementType: Cl Cl O O O N C C C C C C C C C C C C C C C C C C C C C C H H H H H H H H H H H H H H H H H H H
charge: 0
multiplicity: 1
keywords: wb97x-d3
keywords: def2-TZVPP
keywords: def2/J RIJCOSX
keywords: DEFGRID2
keywords: scfconv7
keywords: smallprint printgap noloewdin
keywords: NOSOSCF
formula: C22H19Cl2NO3
InChI: InChI=1/C22H19Cl2NO3/c1-22(2)17(12-19(23)24)20(22)21(26)28-18(13-25)14-7-6-10-16(11-14)27-15-8-4-3-5-9-15/h3-12,17-18,20H,1-2H3
47 atoms
Cl -4.013203 -0.766637 -2.090496
Cl -3.759454 -2.968003 -3.936973
O  1.64413 -1.823157 0.332948
O  -0.021437 -0.623534 1.215981
O  2.06244 4.048152 0.455274
N  4.939177 -1.872876 0.393755
C  -1.661601 -3.265521 0.82136
C  -1.915563 -2.364064 -0.350275
C  -0.486905 -2.679077 0.065885
C  -2.036766 -2.755138 2.191182
C  -1.84972 -4.757313 0.680067
C  -2.389196 -2.876638 -1.640868
C  0.348823 -1.596093 0.610753
C  -3.265639 -2.277813 -2.437428
C  2.570813 -0.824126 0.73979
C  2.435756 0.445885 -0.068009
C  3.890541 -1.428582 0.540335
C  2.333751 1.656848 0.597355
C  2.3868 0.389827 -1.455738
C  2.15317 2.823132 -0.135321
C  2.222305 1.563952 -2.173188
C  2.094662 2.781316 -1.520941
C  1.430938 4.193383 1.661712
C  1.980883 5.105229 2.55136
C  0.260825 3.512049 1.976465
C  1.353179 5.336923 3.766812
C  -0.347051 3.744049 3.201653
C  0.192144 4.654053 4.101041
H  -2.251683 -1.367784 -0.085571
H  0.04663 -3.380886 -0.564841
H  -1.349016 -3.133141 2.950414
H  -3.03645 -3.11318 2.446185
H  -2.053283 -1.669767 2.258885
H  -1.323634 -5.27758 1.482498
H  -1.472685 -5.152829 -0.262286
H  -2.907188 -5.018317 0.755157
H  -1.990848 -3.82352 -1.985137
H  2.469884 -0.607339 1.808769
H  2.38102 1.681185 1.679135
H  2.469696 -0.555745 -1.976995
H  2.179144 1.53273 -3.253806
H  1.950304 3.695313 -2.083089
H  2.890565 5.631347 2.290357
H  -0.178142 2.804751 1.28366
H  1.78261 6.050874 4.457685
H  -1.254846 3.208934 3.448999
H  -0.289763 4.83002 5.053625
elementType: Cl O N C H
totalener: -2050.68593516 hartree
nucrepener: 2743.48158622 hartree
electener: -4794.16752138 hartree
oneelecener: -8262.36553180 hartree
twoeener: 3468.19801042 hartree
cpcmener: -0.03119342 hartree
kineticenergy: 2044.47019525 hartree
xcener: -151.863514605510 hartree
chargesum: 0.0000000
charge: -0.054328 -0.059533 -0.278936 -0.442608 -0.327328 -0.087217 0.091467 0.026942 -0.067648 -0.269450 -0.265536 -0.202823 0.384193 0.041936 0.404888 0.023161 -0.223066 -0.200916 -0.229537 0.283258 -0.122144 -0.226278 0.292880 -0.254075 -0.194450 -0.117773 -0.140301 -0.189090 0.083941 0.095465 0.100594 0.097292 0.095749 0.098392 0.090777 0.102174 0.128789 0.138946 0.144683 0.147004 0.158876 0.148508 0.145448 0.152827 0.157856 0.159445 0.157547
qa: -0.0543 -0.0595 -0.2789 -0.4426 -0.3273 -0.0872 0.0915 0.0269 -0.0676 -0.2695 -0.2655 -0.2028 0.3842 0.0419 0.4049 0.0232 -0.2231 -0.2009 -0.2295 0.2833 -0.1221 -0.2263 0.2929 -0.2541 -0.1944 -0.1178 -0.1403 -0.1891 0.0839 0.0955 0.1006 0.0973 0.0957 0.0984 0.0908 0.1022 0.1288 0.1389 0.1447 0.1470 0.1589 0.1485 0.1454 0.1528 0.1579 0.1594 0.1575
va: 1.2714 1.2452 2.1324 2.0669 2.0858 3.1113 3.7310 3.8736 3.8460 3.9051 3.9106 3.8986 4.1762 4.2127 3.7338 3.5908 4.0745 3.9433 3.9795 3.7358 3.9096 4.0091 3.6890 4.0126 3.9050 3.8811 3.8894 3.9107 1.0442 1.0339 0.9993 1.0000 1.0191 1.0013 1.0060 1.0005 1.0192 1.0171 1.0053 1.0108 0.9892 1.0050 1.0084 1.0031 0.9889 0.9902 0.9907
dispcorr: -0.023542564 hartree
energy: -2050.709477724155
dipole: 9.01821 -10.21904 -1.20083 1.58758 -2.24292 -0.65533 26.29401 -25.54646 0.74755
magnitude: 1.55894 au
magnitude: 3.96250 debye
