program: Orca
programVersion: 5.0.2
elementType: Cl Cl O O O N C C C C C C C C C C C C C C C C C C C C C C H H H H H H H H H H H H H H H H H H H
charge: 0
multiplicity: 1
keywords: wb97x-d3
keywords: def2-TZVPP
keywords: def2/J RIJCOSX
keywords: DEFGRID2
keywords: scfconv7
keywords: smallprint printgap noloewdin
keywords: NOSOSCF
formula: C22H19Cl2NO3
InChI: InChI=1/C22H19Cl2NO3/c1-22(2)17(12-19(23)24)20(22)21(26)28-18(13-25)14-7-6-10-16(11-14)27-15-8-4-3-5-9-15/h3-12,17-18,20H,1-2H3
47 atoms
Cl -1.382057 -0.248113 1.586348
Cl -4.263294 -0.337096 1.807166
O  1.104389 -1.735727 -1.149353
O  1.420617 -3.0306 0.648138
O  0.405323 3.16617 0.458003
N  3.142724 -0.225862 -3.264697
C  -1.393822 -4.245094 -0.171705
C  -1.535422 -3.213429 0.88869
C  -0.746438 -2.881676 -0.365255
C  -0.554948 -5.465219 0.112318
C  -2.564897 -4.516021 -1.08466
C  -2.79348 -2.482841 1.150067
C  0.686289 -2.603893 -0.208426
C  -2.812896 -1.198409 1.476646
C  2.366955 -1.110484 -0.93206
C  2.220138 0.011276 0.066708
C  2.783151 -0.611518 -2.24268
C  1.408753 1.096057 -0.245063
C  2.818368 -0.088305 1.315157
C  1.220026 2.092298 0.70003
C  2.602155 0.907665 2.256771
C  1.808991 2.002966 1.953829
C  0.520807 3.859704 -0.721271
C  -0.640254 4.428259 -1.226296
C  1.739519 4.045118 -1.362376
C  -0.577988 5.193906 -2.381518
C  1.782828 4.804112 -2.523653
C  0.630374 5.381661 -3.038798
H  -0.919426 -3.371694 1.770464
H  -1.247185 -2.243776 -1.083873
H  0.23336 -5.284852 0.839821
H  -0.093794 -5.84057 -0.80262
H  -1.190778 -6.257977 0.510604
H  -3.24447 -5.23885 -0.629708
H  -2.220563 -4.934523 -2.03125
H  -3.136073 -3.615057 -1.310387
H  -3.736123 -3.015402 1.099893
H  3.124201 -1.827304 -0.601021
H  0.927265 1.165642 -1.214227
H  3.444607 -0.937875 1.553095
H  3.060888 0.835026 3.233455
H  1.645384 2.785117 2.683857
H  -1.582594 4.276544 -0.715336
H  2.65023 3.613846 -0.966813
H  -1.483885 5.639115 -2.771472
H  2.7323 4.948718 -3.022256
H  0.674617 5.975013 -3.942101
elementType: Cl O N C H
totalener: -2050.67013264 hartree
nucrepener: 2877.68104743 hartree
electener: -4928.35118007 hartree
oneelecener: -8531.67266294 hartree
twoeener: 3603.32148286 hartree
cpcmener: -0.03490518 hartree
kineticenergy: 2044.46468123 hartree
xcener: -151.862597298089 hartree
chargesum: 0.0000000
charge: -0.056139 -0.057099 -0.282764 -0.465776 -0.337365 -0.101450 0.140902 -0.037937 -0.118072 -0.269739 -0.278860 -0.217892 0.380751 0.085725 0.452036 0.046512 -0.231697 -0.227872 -0.187123 0.208747 -0.121196 -0.207550 0.293586 -0.257933 -0.187822 -0.120476 -0.152233 -0.192100 0.116132 0.114579 0.091686 0.101427 0.097488 0.103632 0.100285 0.094222 0.143633 0.140595 0.146907 0.150237 0.162914 0.150841 0.146794 0.155169 0.160349 0.162707 0.161238
qa: -0.0561 -0.0571 -0.2828 -0.4658 -0.3374 -0.1015 0.1409 -0.0379 -0.1181 -0.2697 -0.2789 -0.2179 0.3808 0.0857 0.4520 0.0465 -0.2317 -0.2279 -0.1871 0.2087 -0.1212 -0.2076 0.2936 -0.2579 -0.1878 -0.1205 -0.1522 -0.1921 0.1161 0.1146 0.0917 0.1014 0.0975 0.1036 0.1003 0.0942 0.1436 0.1406 0.1469 0.1502 0.1629 0.1508 0.1468 0.1552 0.1603 0.1627 0.1612
va: 1.2968 1.2501 2.1226 2.0355 2.0541 3.1078 3.7224 3.8782 3.8239 3.8879 3.9141 3.9130 4.1815 4.1762 3.7006 3.5347 4.0844 3.9555 3.9439 3.7126 3.8993 4.0029 3.6735 4.0055 3.8840 3.8824 3.8915 3.8998 1.0234 1.0244 1.0172 0.9991 1.0007 0.9993 1.0027 0.9988 1.0071 1.0164 1.0135 1.0067 0.9876 1.0028 1.0091 0.9992 0.9880 0.9893 0.9894
dispcorr: -0.026649956 hartree
energy: -2050.696782596742
dipole: 7.36718 -8.25622 -0.88903 -11.81671 10.62716 -1.18955 -11.05444 11.74147 0.68703
magnitude: 1.63628 au
magnitude: 4.15910 debye
