program: Orca
programVersion: 5.0.2
elementType: Cl Cl O O O N C C C C C C C C C C C C C C C C C C C C C C H H H H H H H H H H H H H H H H H H H
charge: 0
multiplicity: 1
keywords: wb97x-d3
keywords: def2-TZVPP
keywords: def2/J RIJCOSX
keywords: DEFGRID2
keywords: scfconv7
keywords: smallprint printgap noloewdin
keywords: NOSOSCF
formula: C22H19Cl2NO3
InChI: InChI=1/C22H19Cl2NO3/c1-22(2)17(12-19(23)24)20(22)21(26)28-18(13-25)14-7-6-10-16(11-14)27-15-8-4-3-5-9-15/h3-12,17-18,20H,1-2H3
47 atoms
Cl -1.41093 -1.091828 -2.56581
Cl -2.906469 -2.873948 -4.282898
O  1.173989 -1.896549 0.470589
O  -0.654157 -1.050978 1.438943
O  0.448321 3.930177 0.475493
N  4.427273 -1.352782 0.587088
C  -1.877409 -3.890305 0.747897
C  -2.278977 -2.875793 -0.261234
C  -0.810762 -3.026262 0.088659
C  -2.257899 -3.673623 2.190651
C  -1.845463 -5.344359 0.346516
C  -2.71717 -3.229715 -1.628211
C  -0.14242 -1.900715 0.752399
C  -2.393069 -2.499096 -2.685825
C  1.902812 -0.746823 0.884168
C  1.555828 0.465469 0.051109
C  3.31083 -1.104678 0.708354
C  1.191598 1.643081 0.68478
C  1.574752 0.379217 -1.336535
C  0.858368 2.75156 -0.084562
C  1.217369 1.487049 -2.088145
C  0.864637 2.67766 -1.469528
C  1.029546 4.367414 1.642612
C  0.189832 4.885263 2.616904
C  2.407033 4.350296 1.822641
C  0.738439 5.397067 3.784753
C  2.939971 4.85509 2.999555
C  2.111783 5.378866 3.984014
H  -2.742448 -1.978322 0.140875
H  -0.198114 -3.542754 -0.640861
H  -3.204423 -4.176419 2.395552
H  -2.384593 -2.624751 2.448899
H  -1.507291 -4.100977 2.85723
H  -2.835878 -5.790194 0.453809
H  -1.159916 -5.900777 0.98712
H  -1.523512 -5.488122 -0.68514
H  -3.340648 -4.103661 -1.776497
H  1.751966 -0.537925 1.948083
H  1.161607 1.68591 1.766864
H  1.86431 -0.53973 -1.830416
H  1.225083 1.431004 -3.168259
H  0.592492 3.544553 -2.057721
H  -0.8813 4.892368 2.460416
H  3.061272 3.954004 1.056162
H  0.084235 5.803883 4.544586
H  4.012529 4.843262 3.141917
H  2.535042 5.773864 4.897713
elementType: Cl O N C H
totalener: -2050.67057108 hartree
nucrepener: 2803.56882096 hartree
electener: -4854.23939204 hartree
oneelecener: -8383.16719869 hartree
twoeener: 3528.92780665 hartree
cpcmener: -0.03578027 hartree
kineticenergy: 2044.47014006 hartree
xcener: -151.863813868877 hartree
chargesum: -0.0000000
charge: -0.054125 -0.056477 -0.277498 -0.464786 -0.339465 -0.101166 0.136134 -0.035216 -0.111533 -0.271069 -0.278397 -0.223804 0.379124 0.085352 0.420581 0.048467 -0.217688 -0.168361 -0.290633 0.254683 -0.123193 -0.215869 0.270515 -0.245786 -0.181066 -0.127477 -0.148684 -0.184369 0.115695 0.114050 0.097611 0.092606 0.102840 0.102950 0.099846 0.094550 0.143341 0.140495 0.148611 0.155058 0.165898 0.152023 0.149492 0.160399 0.162011 0.162821 0.161511
qa: -0.0541 -0.0565 -0.2775 -0.4648 -0.3395 -0.1012 0.1361 -0.0352 -0.1115 -0.2711 -0.2784 -0.2238 0.3791 0.0854 0.4206 0.0485 -0.2177 -0.1684 -0.2906 0.2547 -0.1232 -0.2159 0.2705 -0.2458 -0.1811 -0.1275 -0.1487 -0.1844 0.1157 0.1140 0.0976 0.0926 0.1028 0.1029 0.0998 0.0945 0.1433 0.1405 0.1486 0.1551 0.1659 0.1520 0.1495 0.1604 0.1620 0.1628 0.1615
va: 1.2931 1.2506 2.1232 2.0408 2.0637 3.1098 3.7283 3.8735 3.8217 3.8894 3.9146 3.9196 4.1664 4.1791 3.7160 3.5343 4.0782 3.9429 3.9346 3.7391 3.8562 4.0096 3.6900 4.0071 3.9064 3.8793 3.8871 3.8961 1.0231 1.0245 1.0010 1.0173 0.9989 0.9993 1.0026 0.9989 1.0073 1.0179 1.0070 1.0138 0.9873 1.0029 1.0067 0.9954 0.9879 0.9891 0.9892
dispcorr: -0.025685454 hartree
energy: -2050.696256536361
dipole: 2.12770 -3.52978 -1.40208 -0.13545 -0.71047 -0.84592 27.44439 -26.82654 0.61785
magnitude: 1.75018 au
magnitude: 4.44861 debye
