program: Orca
programVersion: 5.0.2
elementType: Cl Cl O O O N C C C C C C C C C C C C C C C C C C C C C C H H H H H H H H H H H H H H H H H H H
charge: 0
multiplicity: 1
keywords: wb97x-d3
keywords: def2-TZVPP
keywords: def2/J RIJCOSX
keywords: DEFGRID2
keywords: scfconv7
keywords: smallprint printgap noloewdin
keywords: NOSOSCF
formula: C22H19Cl2NO3
InChI: InChI=1/C22H19Cl2NO3/c1-22(2)17(12-19(23)24)20(22)21(26)28-18(13-25)14-7-6-10-16(11-14)27-15-8-4-3-5-9-15/h3-12,17-18,20H,1-2H3
47 atoms
Cl -4.392558 -0.643923 -1.384825
Cl -4.254472 -2.105395 -3.866276
O  1.593862 -1.821731 0.22579
O  -0.1753 -0.874439 1.215755
O  1.622185 3.881139 0.090128
N  4.720878 -2.17513 1.206413
C  -1.462594 -3.633613 0.273443
C  -1.982439 -2.458514 -0.501037
C  -0.48666 -2.656573 -0.355924
C  -1.683699 -3.642561 1.764861
C  -1.495385 -5.014024 -0.335728
C  -2.586618 -2.599322 -1.830359
C  0.275958 -1.689171 0.450418
C  -3.604061 -1.880447 -2.287285
C  2.462961 -0.900475 0.88406
C  2.640604 0.354165 0.065966
C  3.724917 -1.620656 1.054299
C  2.059397 1.533714 0.514058
C  3.328426 0.312513 -1.140952
C  2.186423 2.686581 -0.251581
C  3.437872 1.469433 -1.897067
C  2.875443 2.656971 -1.458052
C  1.242038 4.125159 1.390538
C  -0.068229 4.517669 1.614198
C  2.154426 4.043961 2.434329
C  -0.46982 4.839183 2.903913
C  1.736083 4.354443 3.719865
C  0.426428 4.752241 3.959846
H  -2.389725 -1.664588 0.114265
H  0.043489 -3.039185 -1.220571
H  -1.738341 -2.646442 2.199059
H  -0.886126 -4.19151 2.269076
H  -2.624797 -4.147606 1.989116
H  -2.489413 -5.452062 -0.229899
H  -0.788685 -5.666578 0.17897
H  -1.234245 -5.023034 -1.392898
H  -2.171524 -3.339785 -2.503345
H  2.095988 -0.657099 1.885479
H  1.51588 1.539396 1.450146
H  3.781025 -0.606863 -1.491548
H  3.974254 1.451367 -2.836317
H  2.967279 3.559958 -2.048193
H  -0.764458 4.57867 0.787248
H  3.178608 3.743783 2.249843
H  -1.491004 5.151002 3.08046
H  2.44236 4.289466 4.537079
H  0.108325 4.995939 4.964648
elementType: Cl O N C H
totalener: -2050.67292308 hartree
nucrepener: 2722.36324174 hartree
electener: -4773.03616483 hartree
oneelecener: -8220.38277920 hartree
twoeener: 3447.34661438 hartree
cpcmener: -0.03557091 hartree
kineticenergy: 2044.44698011 hartree
xcener: -151.859411869470 hartree
chargesum: -0.0000000
charge: -0.057821 -0.061193 -0.279673 -0.472331 -0.333419 -0.102921 0.084032 0.025695 -0.084637 -0.261200 -0.266540 -0.201469 0.427843 0.042507 0.410277 -0.024869 -0.215832 -0.167499 -0.223648 0.300305 -0.123612 -0.239406 0.277040 -0.232208 -0.200481 -0.131509 -0.142125 -0.178243 0.077756 0.101696 0.092429 0.101033 0.099835 0.102370 0.099047 0.093691 0.133205 0.137991 0.139122 0.145633 0.162294 0.149615 0.149502 0.161149 0.161348 0.163137 0.162082
qa: -0.0578 -0.0612 -0.2797 -0.4723 -0.3334 -0.1029 0.0840 0.0257 -0.0846 -0.2612 -0.2665 -0.2015 0.4278 0.0425 0.4103 -0.0249 -0.2158 -0.1675 -0.2236 0.3003 -0.1236 -0.2394 0.2770 -0.2322 -0.2005 -0.1315 -0.1421 -0.1782 0.0778 0.1017 0.0924 0.1010 0.0998 0.1024 0.0990 0.0937 0.1332 0.1380 0.1391 0.1456 0.1623 0.1496 0.1495 0.1611 0.1613 0.1631 0.1621
va: 1.2674 1.2437 2.1368 2.0349 2.0762 3.1072 3.7549 3.8631 3.8332 3.9082 3.9079 3.9047 4.1692 4.2078 3.7176 3.6837 4.0704 3.8989 3.9930 3.7240 3.9121 4.0110 3.6711 4.0122 3.9358 3.8784 3.8785 3.8939 1.0515 1.0308 1.0170 0.9998 1.0000 1.0004 1.0014 1.0053 1.0178 1.0202 1.0214 1.0076 0.9885 1.0058 1.0056 0.9949 0.9884 0.9887 0.9891
dispcorr: -0.022871959 hartree
energy: -2050.695795040881
dipole: 15.40861 -15.92894 -0.52034 -2.93608 2.47967 -0.45641 20.15491 -20.03725 0.11766
magnitude: 0.70207 au
magnitude: 1.78453 debye
