program: Orca
programVersion: 5.0.2
elementType: Cl Cl O O O N C C C C C C C C C C C C C C C C C C C C C C H H H H H H H H H H H H H H H H H H H
charge: 0
multiplicity: 1
keywords: wb97x-d3
keywords: def2-TZVPP
keywords: def2/J RIJCOSX
keywords: DEFGRID2
keywords: scfconv7
keywords: smallprint printgap noloewdin
keywords: NOSOSCF
formula: C22H19Cl2NO3
InChI: InChI=1/C22H19Cl2NO3/c1-22(2)17(12-19(23)24)20(22)21(26)28-18(13-25)14-7-6-10-16(11-14)27-15-8-4-3-5-9-15/h3-12,17-18,20H,1-2H3
47 atoms
Cl -1.183409 -0.092122 -1.813875
Cl -3.171945 -1.026387 -3.694151
O  1.502691 -2.02268 0.304592
O  0.011254 -1.342795 1.834179
O  0.477918 3.431839 -0.002891
N  4.803332 -2.065566 0.407085
C  -1.77569 -3.665175 0.621398
C  -2.103643 -2.355393 -0.000061
C  -0.654057 -2.807388 0.057213
C  -1.954836 -3.821738 2.109728
C  -2.040449 -4.931391 -0.156386
C  -2.749495 -2.209312 -1.32154
C  0.273379 -1.994999 0.854013
C  -2.418619 -1.239387 -2.162685
C  2.430648 -1.018488 0.713618
C  2.230048 0.210377 -0.139685
C  3.754906 -1.610316 0.533753
C  1.512143 1.276297 0.388875
C  2.648757 0.222723 -1.464092
C  1.214853 2.36329 -0.423887
C  2.345575 1.316097 -2.260741
C  1.630856 2.386556 -1.749497
C  0.349882 3.687829 1.344759
C  1.463294 3.988242 2.118634
C  -0.924837 3.695002 1.888819
C  1.28849 4.298067 3.459248
C  -1.086909 4.018499 3.229867
C  0.016242 4.315047 4.018603
H  -2.345211 -1.563058 0.704139
H  -0.235924 -3.169688 -0.874281
H  -2.954903 -4.207028 2.315629
H  -1.848367 -2.885763 2.653212
H  -1.236849 -4.535666 2.51584
H  -1.862851 -4.810742 -1.225222
H  -3.073971 -5.254518 -0.021229
H  -1.392694 -5.734771 0.197227
H  -3.535336 -2.898489 -1.608589
H  2.324398 -0.778385 1.774842
H  1.183862 1.244476 1.419873
H  3.204469 -0.608901 -1.879398
H  2.670845 1.338493 -3.292081
H  1.393846 3.23903 -2.373177
H  2.454034 3.984394 1.680405
H  -1.780827 3.459029 1.268993
H  2.152429 4.533859 4.066999
H  -2.081315 4.033087 3.656946
H  -0.113759 4.563088 5.06354
elementType: Cl O N C H
totalener: -2050.66963118 hartree
nucrepener: 2887.77185674 hartree
electener: -4938.44148793 hartree
oneelecener: -8551.66049432 hartree
twoeener: 3613.21900640 hartree
cpcmener: -0.03391525 hartree
kineticenergy: 2044.45466934 hartree
xcener: -151.860520156033 hartree
chargesum: -0.0000000
charge: -0.056192 -0.057678 -0.275027 -0.465882 -0.332750 -0.102531 0.145245 -0.042390 -0.118371 -0.269349 -0.279781 -0.223170 0.384511 0.090307 0.422318 -0.025443 -0.216445 -0.161261 -0.222029 0.285699 -0.115355 -0.243859 0.260203 -0.183131 -0.219587 -0.148991 -0.139736 -0.169825 0.117166 0.111394 0.097768 0.091618 0.100966 0.094260 0.103043 0.100342 0.144892 0.133845 0.138538 0.141731 0.162397 0.147662 0.159253 0.148508 0.163290 0.161381 0.162447
qa: -0.0562 -0.0577 -0.2750 -0.4659 -0.3327 -0.1025 0.1452 -0.0424 -0.1184 -0.2693 -0.2798 -0.2232 0.3845 0.0903 0.4223 -0.0254 -0.2164 -0.1613 -0.2220 0.2857 -0.1154 -0.2439 0.2602 -0.1831 -0.2196 -0.1490 -0.1397 -0.1698 0.1172 0.1114 0.0978 0.0916 0.1010 0.0943 0.1030 0.1003 0.1449 0.1338 0.1385 0.1417 0.1624 0.1477 0.1593 0.1485 0.1633 0.1614 0.1624
va: 1.3032 1.2489 2.1138 2.0322 2.0690 3.1063 3.7170 3.8781 3.8284 3.8861 3.9139 3.9170 4.1703 4.1769 3.7180 3.6865 4.0692 3.8641 3.9838 3.6914 3.9029 3.9992 3.6861 3.9342 4.0027 3.8844 3.8845 3.8863 1.0230 1.0263 1.0006 1.0178 0.9996 0.9991 0.9994 1.0025 1.0068 1.0224 1.0231 1.0085 0.9876 1.0073 0.9962 1.0059 0.9887 0.9886 0.9888
dispcorr: -0.026749199 hartree
energy: -2050.696380384271
dipole: -0.85083 -0.93918 -1.79001 -7.78977 7.40295 -0.38682 22.44870 -22.08311 0.36559
magnitude: 1.86746 au
magnitude: 4.74671 debye
